Project

General

Profile

Matrix_OnDemand_2245_OPTIONS=clang-8_simd=avx2_256_opencl-1.2_cmake-3.14.5_tidy_host=bs_gpu01_label=bs_gpu01_consoleText.txt

jenkins run console output - Szilárd Páll, 02/28/2020 07:57 PM

 
1
Started by upstream project "Matrix_OnDemand" build number 2245
2
originally caused by:
3
 Started by upstream project "Gromacs_OnDemand_workflow" build number 1686
4
 originally caused by:
5
  Triggered by Gerrit: https://gerrit.gromacs.org/c/gromacs/+/15200
6
Running as SYSTEM
7
[EnvInject] - Loading node environment variables.
8
[EnvInject] - Preparing an environment for the build.
9
[EnvInject] - Keeping Jenkins system variables.
10
[EnvInject] - Keeping Jenkins build variables.
11
[EnvInject] - Evaluating the Groovy script content
12
[EnvInject] - Injecting contributions.
13
Building remotely on bs_gpu01 (clang-6 clang-7 gcc-5 clang-5 gcc-7 clang-format-7 gcc-8) in workspace /home/jenkins/workspace/Matrix_OnDemand/80361d7e
14
No credentials specified
15
 > git rev-parse --is-inside-work-tree # timeout=10
16
Fetching changes from the remote Git repository
17
 > git config remote.origin.url ssh://jenkins@gerrit.gromacs.org/gromacs.git # timeout=10
18
Fetching upstream changes from ssh://jenkins@gerrit.gromacs.org/gromacs.git
19
 > git --version # timeout=10
20
 > git fetch --tags --progress ssh://jenkins@gerrit.gromacs.org/gromacs.git refs/changes/00/15200/4 # timeout=10
21
Checking out Revision a6e23ca5da50c0cd802be032a084d254f4b2bfc2 (refs/changes/00/15200/4)
22
 > git config core.sparsecheckout # timeout=10
23
 > git checkout -f a6e23ca5da50c0cd802be032a084d254f4b2bfc2 # timeout=10
24
Commit message: "Allow PME coordinate send before H2D coordinate transfer"
25
 > git rev-parse FETCH_HEAD^{commit} # timeout=10
26
 > git rev-list --no-walk 320b3e1c07ca770674c0bd67939cd275a4f87f18 # timeout=10
27
Cleaning workspace
28
 > git rev-parse --verify HEAD # timeout=10
29
Resetting working tree
30
 > git reset --hard # timeout=10
31
 > git clean -fdx # timeout=10
32
[80361d7e] $ python /tmp/jenkins8109535621864396626.py
33
Reinitialized existing Git repository in /mnt/workspace/Matrix_OnDemand/80361d7e/releng/.git/
34
From ssh://gerrit.gromacs.org/releng
35
 * branch            master     -> FETCH_HEAD
36
+ git rev-list -n1 --format=oneline HEAD --
37
+ git rev-list -n1 --format=oneline HEAD --
38
+ git ls-remote ssh://jenkins@gerrit.gromacs.org/gromacs.git refs/changes/00/15200/4
39
+ git fetch ssh://jenkins@gerrit.gromacs.org/regressiontests.git refs/heads/release-2020
40
From ssh://gerrit.gromacs.org/regressiontests
41
 * branch            release-2020 -> FETCH_HEAD
42
+ git checkout -qf 67a5ed7d8db516e9a086b7b2d7af3945e7602dde
43
+ git gc
44
+ git clean -ffdxq
45
+ git rev-list -n1 --format=oneline HEAD --
46
-----------------------------------------------------------
47
Building using versions:
48
gromacs:         refs/changes/00/15200/4    a6e23ca5da50c0cd802be032a084d254f4b2bfc2
49
                   Allow PME coordinate send before H2D coordinate transfer
50
regressiontests: refs/heads/release-2020    67a5ed7d8db516e9a086b7b2d7af3945e7602dde
51
                   Update warning message in reference data
52
releng:          refs/heads/master          5a643b775eb5ff3f924f121f8cbf56fedfc0c280
53
                   Clean up Sphinx interpreted text in the default role.
54
-----------------------------------------------------------
55
+ /opt/cmake/3.14.5/bin/cmake --version
56
cmake version 3.14.5
57

    
58
CMake suite maintained and supported by Kitware (kitware.com/cmake).
59
+ /opt/cmake/3.14.5/bin/cmake /home/jenkins/workspace/Matrix_OnDemand/80361d7e/gromacs -DCLANG_TIDY=clang-tidy-8 -DCMAKE_BUILD_TYPE=Debug -DCMAKE_CXX_COMPILER=clang++-8 '-DCMAKE_CXX_LINK_FLAGS=-Wl,-rpath,/usr/bin/../lib64 -L/usr/bin/../lib64' -DCMAKE_C_COMPILER=clang-8 -DCMAKE_INSTALL_PREFIX=/home/jenkins/workspace/Matrix_OnDemand/80361d7e/test-install -DGMXAPI=ON -DGMX_CLANG_TIDY=ON -DGMX_COMPILER_WARNINGS=ON -DGMX_DEFAULT_SUFFIX=OFF -DGMX_GPLUSPLUS_PATH=/usr/bin/gcc-5 -DGMX_GPU=ON -DGMX_HWLOC=AUTO -DGMX_SIMD=AVX2_256 -DGMX_USE_OPENCL=ON -DGMX_USE_RDTSCP=DETECT
60
-- The C compiler identification is Clang 8.0.0
61
-- The CXX compiler identification is Clang 8.0.0
62
-- Check for working C compiler: /home/jenkins/bin/clang-8
63
-- Check for working C compiler: /home/jenkins/bin/clang-8 -- works
64
-- Detecting C compiler ABI info
65
-- Detecting C compiler ABI info - done
66
-- Detecting C compile features
67
-- Detecting C compile features - done
68
-- Check for working CXX compiler: /home/jenkins/bin/clang++-8
69
-- Check for working CXX compiler: /home/jenkins/bin/clang++-8 -- works
70
-- Detecting CXX compiler ABI info
71
-- Detecting CXX compiler ABI info - done
72
-- Detecting CXX compile features
73
-- Detecting CXX compile features - done
74
-- Performing Test USING_LIBSTDCXX
75
-- Performing Test USING_LIBSTDCXX - Success
76
-- Performing Test CXX14_COMPILES
77
-- Performing Test CXX14_COMPILES - Success
78
-- Found Git: /usr/bin/git (found version "2.7.4") 
79
-- Looking for CL_VERSION_2_2
80
-- Looking for CL_VERSION_2_2 - not found
81
-- Looking for CL_VERSION_2_1
82
-- Looking for CL_VERSION_2_1 - not found
83
-- Looking for CL_VERSION_2_0
84
-- Looking for CL_VERSION_2_0 - found
85
-- Found OpenCL: /usr/lib/x86_64-linux-gnu/libOpenCL.so (found version "2.0") 
86
-- Found OpenMP_C: -fopenmp=libomp (found version "3.1") 
87
-- Found OpenMP_CXX: -fopenmp=libomp (found version "3.1") 
88
-- Found OpenMP: TRUE (found version "3.1")  
89
-- Performing Test CFLAGS_WARN
90
-- Performing Test CFLAGS_WARN - Success
91
-- Performing Test CFLAGS_WARN_EXTRA
92
-- Performing Test CFLAGS_WARN_EXTRA - Success
93
-- Performing Test CXXFLAGS_WARN
94
-- Performing Test CXXFLAGS_WARN - Success
95
-- Performing Test CXXFLAGS_WARN_EXTRA
96
-- Performing Test CXXFLAGS_WARN_EXTRA - Success
97
-- Performing Test CXXFLAGS_DEPRECATED
98
-- Performing Test CXXFLAGS_DEPRECATED - Success
99
-- Performing Test CXXFLAGS_NO_UNUSED_FUNCTION
100
-- Performing Test CXXFLAGS_NO_UNUSED_FUNCTION - Success
101
-- Looking for include file unistd.h
102
-- Looking for include file unistd.h - found
103
-- Looking for include file pwd.h
104
-- Looking for include file pwd.h - found
105
-- Looking for include file dirent.h
106
-- Looking for include file dirent.h - found
107
-- Looking for include file time.h
108
-- Looking for include file time.h - found
109
-- Looking for include file sys/time.h
110
-- Looking for include file sys/time.h - found
111
-- Looking for include file io.h
112
-- Looking for include file io.h - not found
113
-- Looking for include file sched.h
114
-- Looking for include file sched.h - found
115
-- Looking for include file xmmintrin.h
116
-- Looking for include file xmmintrin.h - found
117
-- Looking for gettimeofday
118
-- Looking for gettimeofday - found
119
-- Looking for sysconf
120
-- Looking for sysconf - found
121
-- Looking for nice
122
-- Looking for nice - found
123
-- Looking for fsync
124
-- Looking for fsync - found
125
-- Looking for _fileno
126
-- Looking for _fileno - not found
127
-- Looking for fileno
128
-- Looking for fileno - found
129
-- Looking for _commit
130
-- Looking for _commit - not found
131
-- Looking for sigaction
132
-- Looking for sigaction - found
133
-- Performing Test HAVE_BUILTIN_CLZ
134
-- Performing Test HAVE_BUILTIN_CLZ - Success
135
-- Performing Test HAVE_BUILTIN_CLZLL
136
-- Performing Test HAVE_BUILTIN_CLZLL - Success
137
-- Looking for clock_gettime in rt
138
-- Looking for clock_gettime in rt - found
139
-- Looking for feenableexcept in m
140
-- Looking for feenableexcept in m - found
141
-- Looking for fedisableexcept in m
142
-- Looking for fedisableexcept in m - found
143
-- Checking for sched.h GNU affinity API
144
-- Performing Test sched_affinity_compile
145
-- Performing Test sched_affinity_compile - Success
146
-- Looking for include file mm_malloc.h
147
-- Looking for include file mm_malloc.h - found
148
-- Looking for include file malloc.h
149
-- Looking for include file malloc.h - found
150
-- Checking for _mm_malloc()
151
-- Checking for _mm_malloc() - supported
152
-- Looking for posix_memalign
153
-- Looking for posix_memalign - found
154
-- Looking for memalign
155
-- Looking for memalign - not found
156
-- Check if the system is big endian
157
-- Searching 16 bit integer
158
-- Looking for sys/types.h
159
-- Looking for sys/types.h - found
160
-- Looking for stdint.h
161
-- Looking for stdint.h - found
162
-- Looking for stddef.h
163
-- Looking for stddef.h - found
164
-- Check size of unsigned short
165
-- Check size of unsigned short - done
166
-- Using unsigned short
167
-- Check if the system is big endian - little endian
168
-- Looking for HWLOC
169
-- Looking for hwloc_topology_init
170
-- Looking for hwloc_topology_init - found
171
-- hwloc version: 
172
-- Found HWLOC: /usr/lib/x86_64-linux-gnu/libhwloc.so (found suitable version "1.11.2", minimum required is "1.5") 
173
-- Looking for pthread.h
174
-- Looking for pthread.h - found
175
-- Looking for pthread_create
176
-- Looking for pthread_create - not found
177
-- Looking for pthread_create in pthreads
178
-- Looking for pthread_create in pthreads - not found
179
-- Looking for pthread_create in pthread
180
-- Looking for pthread_create in pthread - found
181
-- Found Threads: TRUE  
182
-- Looking for C++ include pthread.h
183
-- Looking for C++ include pthread.h - found
184
-- Atomic operations found
185
-- Performing Test PTHREAD_SETAFFINITY
186
-- Performing Test PTHREAD_SETAFFINITY - Success
187
-- Checking for GCC x86 inline asm
188
-- Checking for GCC x86 inline asm - supported
189
-- Detected build CPU vendor - Intel
190
-- Detected build CPU brand - Intel(R) Core(TM) i7-5960X CPU @ 3.00GHz
191
-- Detected build CPU family - 6
192
-- Detected build CPU model - 63
193
-- Detected build CPU stepping - 2
194
-- Detected build CPU features - aes apic avx avx2 clfsh cmov cx8 cx16 f16c fma htt intel lahf mmx msr nonstop_tsc pcid pclmuldq pdcm pdpe1gb popcnt pse rdrnd rdtscp sse2 sse3 sse4.1 sse4.2 ssse3 tdt x2apic
195
-- Enabling RDTSCP support - detected on the build host
196
-- Checking for 64-bit off_t
197
-- Checking for 64-bit off_t - present
198
-- Checking for fseeko/ftello
199
-- Checking for fseeko/ftello - present
200
-- Checking for SIGUSR1
201
-- Checking for SIGUSR1 - found
202
-- Checking for pipe support
203
-- Checking for system XDR support
204
-- Checking for system XDR support - present
205
-- Performing Test C_mavx2_mfma_FLAG_ACCEPTED
206
-- Performing Test C_mavx2_mfma_FLAG_ACCEPTED - Success
207
-- Performing Test C_mavx2_mfma_COMPILE_WORKS
208
-- Performing Test C_mavx2_mfma_COMPILE_WORKS - Success
209
-- Performing Test CXX_mavx2_mfma_FLAG_ACCEPTED
210
-- Performing Test CXX_mavx2_mfma_FLAG_ACCEPTED - Success
211
-- Performing Test CXX_mavx2_mfma_COMPILE_WORKS
212
-- Performing Test CXX_mavx2_mfma_COMPILE_WORKS - Success
213
-- Enabling 256-bit AVX2 SIMD instructions using CXX flags:  -mavx2 -mfma
214
-- Detecting flags to enable runtime detection of AVX-512 units on newer CPUs
215
-- Performing Test C_xCORE_AVX512_qopt_zmm_usage_high_FLAG_ACCEPTED
216
-- Performing Test C_xCORE_AVX512_qopt_zmm_usage_high_FLAG_ACCEPTED - Failed
217
-- Performing Test C_xCORE_AVX512_FLAG_ACCEPTED
218
-- Performing Test C_xCORE_AVX512_FLAG_ACCEPTED - Failed
219
-- Performing Test C_mavx512f_mfma_FLAG_ACCEPTED
220
-- Performing Test C_mavx512f_mfma_FLAG_ACCEPTED - Success
221
-- Performing Test C_mavx512f_mfma_COMPILE_WORKS
222
-- Performing Test C_mavx512f_mfma_COMPILE_WORKS - Success
223
-- Performing Test CXX_xCORE_AVX512_qopt_zmm_usage_high_FLAG_ACCEPTED
224
-- Performing Test CXX_xCORE_AVX512_qopt_zmm_usage_high_FLAG_ACCEPTED - Failed
225
-- Performing Test CXX_xCORE_AVX512_FLAG_ACCEPTED
226
-- Performing Test CXX_xCORE_AVX512_FLAG_ACCEPTED - Failed
227
-- Performing Test CXX_mavx512f_mfma_FLAG_ACCEPTED
228
-- Performing Test CXX_mavx512f_mfma_FLAG_ACCEPTED - Success
229
-- Performing Test CXX_mavx512f_mfma_COMPILE_WORKS
230
-- Performing Test CXX_mavx512f_mfma_COMPILE_WORKS - Success
231
-- Detecting flags to enable runtime detection of AVX-512 units on newer CPUs -  -mavx512f -mfma
232
-- Performing Test _Wno_unused_command_line_argument_FLAG_ACCEPTED
233
-- Performing Test _Wno_unused_command_line_argument_FLAG_ACCEPTED - Success
234
-- Performing Test _callconv___vectorcall
235
-- Performing Test _callconv___vectorcall - Success
236
-- Performing Test GMX_ICC_NEXTGEN
237
-- Performing Test GMX_ICC_NEXTGEN - Failed
238
-- Checking for module 'fftw3f'
239
--   Found fftw3f, version 3.3.4
240
-- Looking for fftwf_plan_many_dft in /usr/lib/x86_64-linux-gnu/libfftw3f.so
241
-- Looking for fftwf_plan_many_dft in /usr/lib/x86_64-linux-gnu/libfftw3f.so - found
242
-- Looking for fftwf_plan_many_dft_r2c in /usr/lib/x86_64-linux-gnu/libfftw3f.so
243
-- Looking for fftwf_plan_many_dft_r2c in /usr/lib/x86_64-linux-gnu/libfftw3f.so - found
244
-- Looking for fftwf_plan_many_dft_c2r in /usr/lib/x86_64-linux-gnu/libfftw3f.so
245
-- Looking for fftwf_plan_many_dft_c2r in /usr/lib/x86_64-linux-gnu/libfftw3f.so - found
246
-- Looking for fftwf_have_simd_sse in /usr/lib/x86_64-linux-gnu/libfftw3f.so
247
-- Looking for fftwf_have_simd_sse in /usr/lib/x86_64-linux-gnu/libfftw3f.so - not found
248
-- Looking for fftwf_have_sse in /usr/lib/x86_64-linux-gnu/libfftw3f.so
249
-- Looking for fftwf_have_sse in /usr/lib/x86_64-linux-gnu/libfftw3f.so - not found
250
-- Looking for fftwf_have_simd_sse2 in /usr/lib/x86_64-linux-gnu/libfftw3f.so
251
-- Looking for fftwf_have_simd_sse2 in /usr/lib/x86_64-linux-gnu/libfftw3f.so - found
252
-- Using external FFT library - FFTW3
253
-- Looking for sgemm_
254
-- Looking for sgemm_ - not found
255
-- Looking for sgemm_
256
-- Looking for sgemm_ - found
257
-- Found BLAS: /usr/lib/libblas.so  
258
-- Looking for cheev_
259
-- Looking for cheev_ - not found
260
-- Looking for cheev_
261
-- Looking for cheev_ - found
262
-- A library with LAPACK API found.
263
-- Checking for dlopen
264
-- Performing Test HAVE_DLOPEN
265
-- Performing Test HAVE_DLOPEN - Success
266
-- Checking for dlopen - found
267
-- Using dynamic plugins (e.g VMD-supported file formats)
268
-- Checking for suitable VMD version
269
-- VMD plugins not found. Path to VMD can be set with VMDDIR.
270
-- Using manually set binary suffix: ""
271
-- Using manually set library suffix: ""
272
-- Could not convert sample image, ImageMagick convert can not be used. A possible way to fix it can be found here: https://alexvanderbist.com/posts/2018/fixing-imagick-error-unauthorized
273
Traceback (most recent call last):
274
  File "<string>", line 1, in <module>
275
ImportError: No module named 'pygments'
276
-- Could NOT find Sphinx (missing: SPHINX_EXECUTABLE pygments) (Required is at least version "1.6.1")
277
-- Performing Test HAVE_NO_DEPRECATED_COPY
278
-- Performing Test HAVE_NO_DEPRECATED_COPY - Failed
279
-- Performing Test HAS_NO_STRINGOP_TRUNCATION
280
-- Performing Test HAS_NO_STRINGOP_TRUNCATION - Failed
281
-- Performing Test HAS_NO_UNUSED_MEMBER_FUNCTION
282
-- Performing Test HAS_NO_UNUSED_MEMBER_FUNCTION - Success
283
-- Performing Test HAS_NO_REDUNDANT_MOVE
284
-- Performing Test HAS_NO_REDUNDANT_MOVE - Success
285
-- Performing Test HAS_NO_UNUSED
286
-- Performing Test HAS_NO_UNUSED - Success
287
-- Performing Test HAS_NO_UNUSED_PARAMETER
288
-- Performing Test HAS_NO_UNUSED_PARAMETER - Success
289
-- Performing Test HAS_NO_MISSING_DECLARATIONS
290
-- Performing Test HAS_NO_MISSING_DECLARATIONS - Success
291
-- Performing Test HAS_DECL_IN_SOURCE
292
-- Performing Test HAS_DECL_IN_SOURCE - Failed
293
-- Performing Test HAS_NO_CLASS_MEMACCESS
294
-- Performing Test HAS_NO_CLASS_MEMACCESS - Failed
295
-- Found PkgConfig: /usr/bin/pkg-config (found version "0.28") 
296
-- Could NOT find clFFT (missing: clFFT_INCLUDE_DIR clFFT_LIBRARY) 
297
-- Check if the system is big endian
298
-- Searching 16 bit integer
299
-- Using unsigned short
300
-- Check if the system is big endian - little endian
301
-- Looking for inttypes.h
302
-- Looking for inttypes.h - found
303
-- Could NOT find Doxygen (missing: DOXYGEN_EXECUTABLE) 
304
-- Doxygen not found. Documentation targets will not be generated.
305
-- Configuring done
306
-- Generating done
307
-- Build files have been written to: /mnt/workspace/Matrix_OnDemand/80361d7e/gromacs
308
+ /opt/cmake/3.14.5/bin/cmake --build . -- -j8 -k
309
Scanning dependencies of target lmfit_objlib
310
Scanning dependencies of target git-version-info
311
Scanning dependencies of target linearalgebra
312
Scanning dependencies of target tng_io_zlib
313
Scanning dependencies of target tng_io_obj
314
[  0%] Building CXX object src/gromacs/CMakeFiles/lmfit_objlib.dir/__/external/lmfit/lmmin.cpp.o
315
Scanning dependencies of target thread_mpi
316
Scanning dependencies of target clFFT
317
[  0%] Generating git version information
318
Scanning dependencies of target modularsimulator
319
[  0%] Building C object src/gromacs/CMakeFiles/tng_io_zlib.dir/__/external/tng_io/external/zlib/adler32.c.o
320
[  0%] Building CXX object src/gromacs/linearalgebra/CMakeFiles/linearalgebra.dir/eigensolver.cpp.o
321
[  0%] Building CXX object src/gromacs/CMakeFiles/thread_mpi.dir/__/external/thread_mpi/src/errhandler.cpp.o
322
[  0%] Building CXX object src/gromacs/clFFT-build/CMakeFiles/clFFT.dir/library/accessors.cpp.o
323
[  0%] Building C object src/gromacs/CMakeFiles/tng_io_obj.dir/__/external/tng_io/src/compression/bwlzh.c.o
324
[  0%] Building CXX object src/gromacs/modularsimulator/CMakeFiles/modularsimulator.dir/checkpointhelper.cpp.o
325
[  0%] Building C object src/gromacs/CMakeFiles/tng_io_zlib.dir/__/external/tng_io/external/zlib/compress.c.o
326
[  0%] Building CXX object src/gromacs/CMakeFiles/thread_mpi.dir/__/external/thread_mpi/src/tmpi_malloc.cpp.o
327
[  0%] Built target lmfit_objlib
328
[  0%] Building C object src/gromacs/CMakeFiles/tng_io_obj.dir/__/external/tng_io/src/compression/bwt.c.o
329
[  0%] Building CXX object src/gromacs/CMakeFiles/thread_mpi.dir/__/external/thread_mpi/src/atomic.cpp.o
330
[  0%] Building C object src/gromacs/CMakeFiles/tng_io_zlib.dir/__/external/tng_io/external/zlib/crc32.c.o
331
[  0%] Building C object src/gromacs/CMakeFiles/tng_io_obj.dir/__/external/tng_io/src/compression/coder.c.o
332
[  1%] Building CXX object src/gromacs/CMakeFiles/thread_mpi.dir/__/external/thread_mpi/src/lock.cpp.o
333
[  1%] Building C object src/gromacs/CMakeFiles/tng_io_obj.dir/__/external/tng_io/src/compression/dict.c.o
334
[  1%] Building C object src/gromacs/CMakeFiles/tng_io_zlib.dir/__/external/tng_io/external/zlib/deflate.c.o
335
[  1%] Building CXX object src/gromacs/linearalgebra/CMakeFiles/linearalgebra.dir/gmx_arpack.cpp.o
336
[  1%] Building CXX object src/gromacs/CMakeFiles/thread_mpi.dir/__/external/thread_mpi/src/system_error.cpp.o
337
[  1%] Building CXX object src/gromacs/CMakeFiles/thread_mpi.dir/__/external/thread_mpi/src/pthreads.cpp.o
338
[  3%] Building C object src/gromacs/CMakeFiles/tng_io_obj.dir/__/external/tng_io/src/compression/fixpoint.c.o
339
[  3%] Built target git-version-info
340
[  3%] Building C object src/gromacs/CMakeFiles/tng_io_obj.dir/__/external/tng_io/src/compression/huffman.c.o
341
[  3%] Building C object src/gromacs/CMakeFiles/tng_io_zlib.dir/__/external/tng_io/external/zlib/inffast.c.o
342
[  3%] Building CXX object src/gromacs/linearalgebra/CMakeFiles/linearalgebra.dir/matrix.cpp.o
343
[  3%] Building C object src/gromacs/CMakeFiles/tng_io_obj.dir/__/external/tng_io/src/compression/huffmem.c.o
344
[  3%] Building CXX object src/gromacs/linearalgebra/CMakeFiles/linearalgebra.dir/nrjac.cpp.o
345
[  3%] Building CXX object src/gromacs/clFFT-build/CMakeFiles/clFFT.dir/library/action.transpose.cpp.o
346
[  3%] Building C object src/gromacs/CMakeFiles/tng_io_zlib.dir/__/external/tng_io/external/zlib/inflate.c.o
347
[  3%] Building CXX object src/gromacs/CMakeFiles/thread_mpi.dir/__/external/thread_mpi/src/alltoall.cpp.o
348
[  3%] Building C object src/gromacs/CMakeFiles/tng_io_obj.dir/__/external/tng_io/src/compression/lz77.c.o
349
[  3%] Building C object src/gromacs/CMakeFiles/tng_io_zlib.dir/__/external/tng_io/external/zlib/inftrees.c.o
350
[  3%] Building CXX object src/gromacs/CMakeFiles/thread_mpi.dir/__/external/thread_mpi/src/p2p_protocol.cpp.o
351
[  3%] Building C object src/gromacs/CMakeFiles/tng_io_obj.dir/__/external/tng_io/src/compression/merge_sort.c.o
352
[  3%] Building C object src/gromacs/CMakeFiles/tng_io_zlib.dir/__/external/tng_io/external/zlib/trees.c.o
353
[  3%] Building C object src/gromacs/CMakeFiles/tng_io_zlib.dir/__/external/tng_io/external/zlib/uncompr.c.o
354
[  3%] Building C object src/gromacs/CMakeFiles/tng_io_obj.dir/__/external/tng_io/src/compression/mtf.c.o
355
[  3%] Building C object src/gromacs/CMakeFiles/tng_io_zlib.dir/__/external/tng_io/external/zlib/zutil.c.o
356
[  3%] Building CXX object src/gromacs/CMakeFiles/thread_mpi.dir/__/external/thread_mpi/src/barrier.cpp.o
357
[  3%] Building CXX object src/gromacs/linearalgebra/CMakeFiles/linearalgebra.dir/sparsematrix.cpp.o
358
[  3%] Building CXX object src/gromacs/CMakeFiles/thread_mpi.dir/__/external/thread_mpi/src/p2p_send_recv.cpp.o
359
[  3%] Building C object src/gromacs/CMakeFiles/tng_io_obj.dir/__/external/tng_io/src/compression/rle.c.o
360
[  3%] Built target tng_io_zlib
361
[  3%] Building C object src/gromacs/CMakeFiles/tng_io_obj.dir/__/external/tng_io/src/compression/vals16.c.o
362
[  3%] Building C object src/gromacs/CMakeFiles/tng_io_obj.dir/__/external/tng_io/src/compression/tng_compress.c.o
363
[  3%] Building C object src/gromacs/CMakeFiles/tng_io_obj.dir/__/external/tng_io/src/compression/warnmalloc.c.o
364
[  3%] Building CXX object src/gromacs/CMakeFiles/thread_mpi.dir/__/external/thread_mpi/src/bcast.cpp.o
365
[  3%] Built target linearalgebra
366
[  3%] Building CXX object src/gromacs/CMakeFiles/thread_mpi.dir/__/external/thread_mpi/src/p2p_wait.cpp.o
367
Scanning dependencies of target vmddlopen
368
[  3%] Building CXX object src/gromacs/CMakeFiles/thread_mpi.dir/__/external/thread_mpi/src/collective.cpp.o
369
[  3%] Building CXX object src/gromacs/fileio/CMakeFiles/vmddlopen.dir/__/__/external/vmd_molfile/vmddlopen.cpp.o
370
[  3%] Building CXX object src/gromacs/modularsimulator/CMakeFiles/modularsimulator.dir/compositesimulatorelement.cpp.o
371
[  3%] Building CXX object src/gromacs/CMakeFiles/thread_mpi.dir/__/external/thread_mpi/src/profile.cpp.o
372
[  3%] Built target vmddlopen
373
[  3%] Building C object src/gromacs/CMakeFiles/tng_io_obj.dir/__/external/tng_io/src/compression/widemuldiv.c.o
374
Scanning dependencies of target scanner
375
[  3%] Building CXX object src/gromacs/selection/CMakeFiles/scanner.dir/parser.cpp.o
376
Scanning dependencies of target view_objlib
377
[  3%] Building C object src/gromacs/CMakeFiles/tng_io_obj.dir/__/external/tng_io/src/compression/xtc2.c.o
378
[  3%] Building CXX object src/gromacs/CMakeFiles/thread_mpi.dir/__/external/thread_mpi/src/comm.cpp.o
379
[  3%] Building CXX object src/programs/CMakeFiles/view_objlib.dir/view/view.cpp.o
380
[  3%] Building CXX object src/gromacs/CMakeFiles/thread_mpi.dir/__/external/thread_mpi/src/reduce.cpp.o
381
[  3%] Building CXX object src/gromacs/clFFT-build/CMakeFiles/clFFT.dir/library/enqueue.cpp.o
382
[  3%] Building C object src/gromacs/CMakeFiles/tng_io_obj.dir/__/external/tng_io/src/compression/xtc3.c.o
383
[  3%] Building CXX object src/gromacs/CMakeFiles/thread_mpi.dir/__/external/thread_mpi/src/event.cpp.o
384
Scanning dependencies of target mdrun_objlib
385
[  3%] Building C object src/gromacs/CMakeFiles/tng_io_obj.dir/__/external/tng_io/src/lib/tng_io.c.o
386
[  3%] Building CXX object src/gromacs/modularsimulator/CMakeFiles/modularsimulator.dir/computeglobalselement.cpp.o
387
[  3%] Building CXX object src/gromacs/CMakeFiles/thread_mpi.dir/__/external/thread_mpi/src/reduce_fast.cpp.o
388
[  3%] Building CXX object src/programs/CMakeFiles/mdrun_objlib.dir/mdrun/mdrun.cpp.o
389
[  4%] Building CXX object src/gromacs/CMakeFiles/thread_mpi.dir/__/external/thread_mpi/src/gather.cpp.o
390
[  4%] Building CXX object src/gromacs/CMakeFiles/thread_mpi.dir/__/external/thread_mpi/src/scatter.cpp.o
391
[  4%] Building CXX object src/gromacs/CMakeFiles/thread_mpi.dir/__/external/thread_mpi/src/group.cpp.o
392
[  6%] Building C object src/gromacs/CMakeFiles/tng_io_obj.dir/__/external/tng_io/src/lib/md5.c.o
393
[  6%] Building CXX object src/gromacs/CMakeFiles/thread_mpi.dir/__/external/thread_mpi/src/tmpi_init.cpp.o
394
[  6%] Building CXX object src/gromacs/clFFT-build/CMakeFiles/clFFT.dir/library/fft_binary_lookup.cpp.o
395
[  6%] Built target view_objlib
396
[  6%] Building CXX object src/gromacs/modularsimulator/CMakeFiles/modularsimulator.dir/constraintelement.cpp.o
397
[  6%] Building CXX object src/gromacs/CMakeFiles/thread_mpi.dir/__/external/thread_mpi/src/topology.cpp.o
398
[  6%] Built target tng_io_obj
399
[  6%] Building CXX object src/gromacs/modularsimulator/CMakeFiles/modularsimulator.dir/domdechelper.cpp.o
400
[  6%] Building CXX object src/gromacs/CMakeFiles/thread_mpi.dir/__/external/thread_mpi/src/list.cpp.o
401
[  6%] Building CXX object src/gromacs/CMakeFiles/thread_mpi.dir/__/external/thread_mpi/src/type.cpp.o
402
[  6%] Building CXX object src/gromacs/CMakeFiles/thread_mpi.dir/__/external/thread_mpi/src/scan.cpp.o
403
[  6%] Building CXX object src/gromacs/CMakeFiles/thread_mpi.dir/__/external/thread_mpi/src/numa_malloc.cpp.o
404
[  6%] Building CXX object src/gromacs/modularsimulator/CMakeFiles/modularsimulator.dir/energyelement.cpp.o
405
[  6%] Building CXX object src/gromacs/CMakeFiles/thread_mpi.dir/__/external/thread_mpi/src/once.cpp.o
406
[  6%] Built target thread_mpi
407
[  6%] Building CXX object src/gromacs/modularsimulator/CMakeFiles/modularsimulator.dir/forceelement.cpp.o
408
[  8%] Building CXX object src/gromacs/selection/CMakeFiles/scanner.dir/scanner.cpp.o
409
[  8%] Building CXX object src/programs/CMakeFiles/mdrun_objlib.dir/mdrun/nonbonded_bench.cpp.o
410
[  9%] Building CXX object src/gromacs/clFFT-build/CMakeFiles/clFFT.dir/library/generator.copy.cpp.o
411
[  9%] Building CXX object src/gromacs/clFFT-build/CMakeFiles/clFFT.dir/library/generator.stockham.cpp.o
412
[  9%] Building CXX object src/gromacs/modularsimulator/CMakeFiles/modularsimulator.dir/freeenergyperturbationelement.cpp.o
413
[  9%] Building CXX object src/gromacs/modularsimulator/CMakeFiles/modularsimulator.dir/modularsimulator.cpp.o
414
[  9%] Building CXX object src/gromacs/clFFT-build/CMakeFiles/clFFT.dir/library/generator.transpose.cpp.o
415
[  9%] Built target scanner
416
[  9%] Building CXX object src/gromacs/modularsimulator/CMakeFiles/modularsimulator.dir/parrinellorahmanbarostat.cpp.o
417
[ 11%] Building CXX object src/gromacs/modularsimulator/CMakeFiles/modularsimulator.dir/pmeloadbalancehelper.cpp.o
418
[ 11%] Building CXX object src/gromacs/modularsimulator/CMakeFiles/modularsimulator.dir/propagator.cpp.o
419
[ 11%] Built target mdrun_objlib
420
[ 11%] Building CXX object src/gromacs/clFFT-build/CMakeFiles/clFFT.dir/library/generator.transpose.gcn.cpp.o
421
[ 11%] Building CXX object src/gromacs/modularsimulator/CMakeFiles/modularsimulator.dir/shellfcelement.cpp.o
422
[ 11%] Building CXX object src/gromacs/modularsimulator/CMakeFiles/modularsimulator.dir/signallers.cpp.o
423
[ 11%] Building CXX object src/gromacs/modularsimulator/CMakeFiles/modularsimulator.dir/statepropagatordata.cpp.o
424
[ 11%] Building CXX object src/gromacs/clFFT-build/CMakeFiles/clFFT.dir/library/lifetime.cpp.o
425
[ 11%] Building CXX object src/gromacs/modularsimulator/CMakeFiles/modularsimulator.dir/topologyholder.cpp.o
426
[ 11%] Building CXX object src/gromacs/modularsimulator/CMakeFiles/modularsimulator.dir/trajectoryelement.cpp.o
427
[ 11%] Building CXX object src/gromacs/modularsimulator/CMakeFiles/modularsimulator.dir/vrescalethermostat.cpp.o
428
[ 11%] Building CXX object src/gromacs/clFFT-build/CMakeFiles/clFFT.dir/library/md5sum.cpp.o
429
[ 11%] Building CXX object src/gromacs/clFFT-build/CMakeFiles/clFFT.dir/library/plan.cpp.o
430
[ 11%] Building CXX object src/gromacs/clFFT-build/CMakeFiles/clFFT.dir/library/repo.cpp.o
431
[ 11%] Building CXX object src/gromacs/clFFT-build/CMakeFiles/clFFT.dir/library/stdafx.cpp.o
432
[ 11%] Building CXX object src/gromacs/clFFT-build/CMakeFiles/clFFT.dir/library/transform.cpp.o
433
[ 11%] Building CXX object src/gromacs/clFFT-build/CMakeFiles/clFFT.dir/statTimer/statisticalTimer.CPU.cpp.o
434
[ 11%] Building CXX object src/gromacs/clFFT-build/CMakeFiles/clFFT.dir/statTimer/statisticalTimer.extern.cpp.o
435
[ 11%] Building CXX object src/gromacs/clFFT-build/CMakeFiles/clFFT.dir/statTimer/statisticalTimer.GPU.cpp.o
436
[ 11%] Built target modularsimulator
437
[ 11%] Building CXX object src/gromacs/clFFT-build/CMakeFiles/clFFT.dir/statTimer/stdafx.cpp.o
438
[ 11%] Built target clFFT
439
[ 11%] Generating baseversion-gen.cpp
440
Scanning dependencies of target libgromacs
441
[ 11%] Building CXX object src/gromacs/CMakeFiles/libgromacs.dir/utility/alignedallocator.cpp.o
442
[ 11%] Building CXX object src/gromacs/CMakeFiles/libgromacs.dir/utility/basenetwork.cpp.o
443
[ 11%] Building CXX object src/gromacs/CMakeFiles/libgromacs.dir/utility/any.cpp.o
444
[ 11%] Building CXX object src/gromacs/CMakeFiles/libgromacs.dir/utility/coolstuff.cpp.o
445
[ 11%] Building CXX object src/gromacs/CMakeFiles/libgromacs.dir/utility/baseversion.cpp.o
446
[ 11%] Building CXX object src/gromacs/CMakeFiles/libgromacs.dir/utility/cstringutil.cpp.o
447
[ 11%] Building CXX object src/gromacs/CMakeFiles/libgromacs.dir/utility/compare.cpp.o
448
[ 11%] Building CXX object src/gromacs/CMakeFiles/libgromacs.dir/utility/binaryinformation.cpp.o
449
[ 11%] Building CXX object src/gromacs/CMakeFiles/libgromacs.dir/utility/datafilefinder.cpp.o
450
[ 11%] Building CXX object src/gromacs/CMakeFiles/libgromacs.dir/utility/directoryenumerator.cpp.o
451
[ 11%] Building CXX object src/gromacs/CMakeFiles/libgromacs.dir/utility/errorcodes.cpp.o
452
[ 12%] Building CXX object src/gromacs/CMakeFiles/libgromacs.dir/utility/errorformat.cpp.o
453
[ 12%] Building CXX object src/gromacs/CMakeFiles/libgromacs.dir/utility/exceptions.cpp.o
454
[ 12%] Building CXX object src/gromacs/CMakeFiles/libgromacs.dir/utility/fatalerror.cpp.o
455
[ 12%] Building CXX object src/gromacs/CMakeFiles/libgromacs.dir/utility/fileredirector.cpp.o
456
[ 12%] Building CXX object src/gromacs/CMakeFiles/libgromacs.dir/utility/filestream.cpp.o
457
[ 12%] Building CXX object src/gromacs/CMakeFiles/libgromacs.dir/utility/futil.cpp.o
458
[ 12%] Building CXX object src/gromacs/CMakeFiles/libgromacs.dir/utility/gmxassert.cpp.o
459
[ 12%] Building CXX object src/gromacs/CMakeFiles/libgromacs.dir/utility/gmxomp.cpp.o
460
[ 12%] Building CXX object src/gromacs/CMakeFiles/libgromacs.dir/utility/ikeyvaluetreeerror.cpp.o
461
[ 12%] Building CXX object src/gromacs/CMakeFiles/libgromacs.dir/utility/init.cpp.o
462
[ 12%] Building CXX object src/gromacs/CMakeFiles/libgromacs.dir/utility/inmemoryserializer.cpp.o
463
[ 12%] Building CXX object src/gromacs/CMakeFiles/libgromacs.dir/utility/int64_to_int.cpp.o
464
[ 12%] Building CXX object src/gromacs/CMakeFiles/libgromacs.dir/utility/keyvaluetree.cpp.o
465
[ 12%] Building CXX object src/gromacs/CMakeFiles/libgromacs.dir/utility/keyvaluetreemdpwriter.cpp.o
466
[ 14%] Building CXX object src/gromacs/CMakeFiles/libgromacs.dir/utility/keyvaluetreeserializer.cpp.o
467
[ 14%] Building CXX object src/gromacs/CMakeFiles/libgromacs.dir/utility/keyvaluetreetransform.cpp.o
468
[ 14%] Building CXX object src/gromacs/CMakeFiles/libgromacs.dir/utility/logger.cpp.o
469
[ 14%] Building CXX object src/gromacs/CMakeFiles/libgromacs.dir/utility/loggerbuilder.cpp.o
470
[ 14%] Building CXX object src/gromacs/CMakeFiles/libgromacs.dir/utility/messagestringcollector.cpp.o
471
[ 14%] Building CXX object src/gromacs/CMakeFiles/libgromacs.dir/utility/mpiinplacebuffers.cpp.o
472
[ 14%] Building CXX object src/gromacs/CMakeFiles/libgromacs.dir/utility/niceheader.cpp.o
473
[ 14%] Building CXX object src/gromacs/CMakeFiles/libgromacs.dir/utility/path.cpp.o
474
[ 14%] Building CXX object src/gromacs/CMakeFiles/libgromacs.dir/utility/physicalnodecommunicator.cpp.o
475
[ 14%] Building CXX object src/gromacs/CMakeFiles/libgromacs.dir/utility/pleasecite.cpp.o
476
[ 14%] Building CXX object src/gromacs/CMakeFiles/libgromacs.dir/utility/programcontext.cpp.o
477
[ 14%] Building CXX object src/gromacs/CMakeFiles/libgromacs.dir/utility/smalloc.cpp.o
478
[ 14%] Building CXX object src/gromacs/CMakeFiles/libgromacs.dir/utility/strconvert.cpp.o
479
[ 14%] Building CXX object src/gromacs/CMakeFiles/libgromacs.dir/utility/strdb.cpp.o
480
[ 14%] Building CXX object src/gromacs/CMakeFiles/libgromacs.dir/utility/stringstream.cpp.o
481
[ 16%] Building CXX object src/gromacs/CMakeFiles/libgromacs.dir/utility/stringutil.cpp.o
482
[ 16%] Building CXX object src/gromacs/CMakeFiles/libgromacs.dir/utility/sysinfo.cpp.o
483
[ 16%] Building CXX object src/gromacs/CMakeFiles/libgromacs.dir/utility/textreader.cpp.o
484
[ 16%] Building CXX object src/gromacs/CMakeFiles/libgromacs.dir/utility/textwriter.cpp.o
485
[ 16%] Building CXX object src/gromacs/CMakeFiles/libgromacs.dir/utility/txtdump.cpp.o
486
[ 16%] Building CXX object src/gromacs/CMakeFiles/libgromacs.dir/nbnxm/atomdata.cpp.o
487
[ 16%] Building CXX object src/gromacs/CMakeFiles/libgromacs.dir/nbnxm/benchmark/bench_setup.cpp.o
488
[ 16%] Building CXX object src/gromacs/CMakeFiles/libgromacs.dir/nbnxm/benchmark/bench_system.cpp.o
489
[ 16%] Building CXX object src/gromacs/CMakeFiles/libgromacs.dir/nbnxm/grid.cpp.o
490
[ 16%] Building CXX object src/gromacs/CMakeFiles/libgromacs.dir/nbnxm/gridset.cpp.o
491
[ 16%] Building CXX object src/gromacs/CMakeFiles/libgromacs.dir/nbnxm/kernel_common.cpp.o
492
[ 16%] Building CXX object src/gromacs/CMakeFiles/libgromacs.dir/nbnxm/kerneldispatch.cpp.o
493
[ 16%] Building CXX object src/gromacs/CMakeFiles/libgromacs.dir/nbnxm/kernels_reference/kernel_gpu_ref.cpp.o
494
[ 16%] Building CXX object src/gromacs/CMakeFiles/libgromacs.dir/nbnxm/kernels_reference/kernel_ref.cpp.o
495
[ 17%] Building CXX object src/gromacs/CMakeFiles/libgromacs.dir/nbnxm/kernels_reference/kernel_ref_prune.cpp.o
496
[ 17%] Building CXX object src/gromacs/CMakeFiles/libgromacs.dir/nbnxm/kernels_simd_2xmm/kernel_ElecEwTwinCut_VdwLJCombGeom_F.cpp.o
497
[ 17%] Building CXX object src/gromacs/CMakeFiles/libgromacs.dir/nbnxm/kernels_simd_2xmm/kernel_ElecEwTwinCut_VdwLJCombGeom_VF.cpp.o
498
[ 17%] Building CXX object src/gromacs/CMakeFiles/libgromacs.dir/nbnxm/kernels_simd_2xmm/kernel_ElecEwTwinCut_VdwLJCombGeom_VgrpF.cpp.o
499
[ 17%] Building CXX object src/gromacs/CMakeFiles/libgromacs.dir/nbnxm/kernels_simd_2xmm/kernel_ElecEwTwinCut_VdwLJCombLB_F.cpp.o
500
[ 17%] Building CXX object src/gromacs/CMakeFiles/libgromacs.dir/nbnxm/kernels_simd_2xmm/kernel_ElecEwTwinCut_VdwLJCombLB_VF.cpp.o
501
[ 17%] Building CXX object src/gromacs/CMakeFiles/libgromacs.dir/nbnxm/kernels_simd_2xmm/kernel_ElecEwTwinCut_VdwLJCombLB_VgrpF.cpp.o
502
[ 17%] Building CXX object src/gromacs/CMakeFiles/libgromacs.dir/nbnxm/kernels_simd_2xmm/kernel_ElecEwTwinCut_VdwLJEwCombGeom_F.cpp.o
503
[ 17%] Building CXX object src/gromacs/CMakeFiles/libgromacs.dir/nbnxm/kernels_simd_2xmm/kernel_ElecEwTwinCut_VdwLJEwCombGeom_VF.cpp.o
504
[ 17%] Building CXX object src/gromacs/CMakeFiles/libgromacs.dir/nbnxm/kernels_simd_2xmm/kernel_ElecEwTwinCut_VdwLJEwCombGeom_VgrpF.cpp.o
505
[ 17%] Building CXX object src/gromacs/CMakeFiles/libgromacs.dir/nbnxm/kernels_simd_2xmm/kernel_ElecEwTwinCut_VdwLJFSw_F.cpp.o
506
[ 17%] Building CXX object src/gromacs/CMakeFiles/libgromacs.dir/nbnxm/kernels_simd_2xmm/kernel_ElecEwTwinCut_VdwLJFSw_VF.cpp.o
507
[ 17%] Building CXX object src/gromacs/CMakeFiles/libgromacs.dir/nbnxm/kernels_simd_2xmm/kernel_ElecEwTwinCut_VdwLJFSw_VgrpF.cpp.o
508
[ 17%] Building CXX object src/gromacs/CMakeFiles/libgromacs.dir/nbnxm/kernels_simd_2xmm/kernel_ElecEwTwinCut_VdwLJPSw_F.cpp.o
509
[ 17%] Building CXX object src/gromacs/CMakeFiles/libgromacs.dir/nbnxm/kernels_simd_2xmm/kernel_ElecEwTwinCut_VdwLJPSw_VF.cpp.o
510
[ 19%] Building CXX object src/gromacs/CMakeFiles/libgromacs.dir/nbnxm/kernels_simd_2xmm/kernel_ElecEwTwinCut_VdwLJPSw_VgrpF.cpp.o
511
[ 19%] Building CXX object src/gromacs/CMakeFiles/libgromacs.dir/nbnxm/kernels_simd_2xmm/kernel_ElecEwTwinCut_VdwLJ_F.cpp.o
512
[ 19%] Building CXX object src/gromacs/CMakeFiles/libgromacs.dir/nbnxm/kernels_simd_2xmm/kernel_ElecEwTwinCut_VdwLJ_VF.cpp.o
513
[ 19%] Building CXX object src/gromacs/CMakeFiles/libgromacs.dir/nbnxm/kernels_simd_2xmm/kernel_ElecEwTwinCut_VdwLJ_VgrpF.cpp.o
514
[ 19%] Building CXX object src/gromacs/CMakeFiles/libgromacs.dir/nbnxm/kernels_simd_2xmm/kernel_ElecEw_VdwLJCombGeom_F.cpp.o
515
[ 19%] Building CXX object src/gromacs/CMakeFiles/libgromacs.dir/nbnxm/kernels_simd_2xmm/kernel_ElecEw_VdwLJCombGeom_VF.cpp.o
516
[ 19%] Building CXX object src/gromacs/CMakeFiles/libgromacs.dir/nbnxm/kernels_simd_2xmm/kernel_ElecEw_VdwLJCombGeom_VgrpF.cpp.o
517
[ 19%] Building CXX object src/gromacs/CMakeFiles/libgromacs.dir/nbnxm/kernels_simd_2xmm/kernel_ElecEw_VdwLJCombLB_F.cpp.o
518
[ 19%] Building CXX object src/gromacs/CMakeFiles/libgromacs.dir/nbnxm/kernels_simd_2xmm/kernel_ElecEw_VdwLJCombLB_VF.cpp.o
519
[ 19%] Building CXX object src/gromacs/CMakeFiles/libgromacs.dir/nbnxm/kernels_simd_2xmm/kernel_ElecEw_VdwLJCombLB_VgrpF.cpp.o
520
[ 19%] Building CXX object src/gromacs/CMakeFiles/libgromacs.dir/nbnxm/kernels_simd_2xmm/kernel_ElecEw_VdwLJEwCombGeom_F.cpp.o
521
[ 19%] Building CXX object src/gromacs/CMakeFiles/libgromacs.dir/nbnxm/kernels_simd_2xmm/kernel_ElecEw_VdwLJEwCombGeom_VF.cpp.o
522
[ 19%] Building CXX object src/gromacs/CMakeFiles/libgromacs.dir/nbnxm/kernels_simd_2xmm/kernel_ElecEw_VdwLJEwCombGeom_VgrpF.cpp.o
523
[ 19%] Building CXX object src/gromacs/CMakeFiles/libgromacs.dir/nbnxm/kernels_simd_2xmm/kernel_ElecEw_VdwLJFSw_F.cpp.o
524
[ 20%] Building CXX object src/gromacs/CMakeFiles/libgromacs.dir/nbnxm/kernels_simd_2xmm/kernel_ElecEw_VdwLJFSw_VF.cpp.o
525
[ 20%] Building CXX object src/gromacs/CMakeFiles/libgromacs.dir/nbnxm/kernels_simd_2xmm/kernel_ElecEw_VdwLJFSw_VgrpF.cpp.o
526
[ 20%] Building CXX object src/gromacs/CMakeFiles/libgromacs.dir/nbnxm/kernels_simd_2xmm/kernel_ElecEw_VdwLJPSw_F.cpp.o
527
[ 20%] Building CXX object src/gromacs/CMakeFiles/libgromacs.dir/nbnxm/kernels_simd_2xmm/kernel_ElecEw_VdwLJPSw_VF.cpp.o
528
[ 20%] Building CXX object src/gromacs/CMakeFiles/libgromacs.dir/nbnxm/kernels_simd_2xmm/kernel_ElecEw_VdwLJPSw_VgrpF.cpp.o
529
[ 20%] Building CXX object src/gromacs/CMakeFiles/libgromacs.dir/nbnxm/kernels_simd_2xmm/kernel_ElecEw_VdwLJ_F.cpp.o
530
[ 20%] Building CXX object src/gromacs/CMakeFiles/libgromacs.dir/nbnxm/kernels_simd_2xmm/kernel_ElecEw_VdwLJ_VF.cpp.o
531
[ 20%] Building CXX object src/gromacs/CMakeFiles/libgromacs.dir/nbnxm/kernels_simd_2xmm/kernel_ElecEw_VdwLJ_VgrpF.cpp.o
532
[ 20%] Building CXX object src/gromacs/CMakeFiles/libgromacs.dir/nbnxm/kernels_simd_2xmm/kernel_ElecQSTabTwinCut_VdwLJCombGeom_F.cpp.o
533
[ 20%] Building CXX object src/gromacs/CMakeFiles/libgromacs.dir/nbnxm/kernels_simd_2xmm/kernel_ElecQSTabTwinCut_VdwLJCombGeom_VF.cpp.o
534
[ 20%] Building CXX object src/gromacs/CMakeFiles/libgromacs.dir/nbnxm/kernels_simd_2xmm/kernel_ElecQSTabTwinCut_VdwLJCombGeom_VgrpF.cpp.o
535
[ 20%] Building CXX object src/gromacs/CMakeFiles/libgromacs.dir/nbnxm/kernels_simd_2xmm/kernel_ElecQSTabTwinCut_VdwLJCombLB_F.cpp.o
536
[ 20%] Building CXX object src/gromacs/CMakeFiles/libgromacs.dir/nbnxm/kernels_simd_2xmm/kernel_ElecQSTabTwinCut_VdwLJCombLB_VF.cpp.o
537
[ 20%] Building CXX object src/gromacs/CMakeFiles/libgromacs.dir/nbnxm/kernels_simd_2xmm/kernel_ElecQSTabTwinCut_VdwLJCombLB_VgrpF.cpp.o
538
[ 22%] Building CXX object src/gromacs/CMakeFiles/libgromacs.dir/nbnxm/kernels_simd_2xmm/kernel_ElecQSTabTwinCut_VdwLJEwCombGeom_F.cpp.o
539
[ 22%] Building CXX object src/gromacs/CMakeFiles/libgromacs.dir/nbnxm/kernels_simd_2xmm/kernel_ElecQSTabTwinCut_VdwLJEwCombGeom_VF.cpp.o
540
[ 22%] Building CXX object src/gromacs/CMakeFiles/libgromacs.dir/nbnxm/kernels_simd_2xmm/kernel_ElecQSTabTwinCut_VdwLJEwCombGeom_VgrpF.cpp.o
541
[ 22%] Building CXX object src/gromacs/CMakeFiles/libgromacs.dir/nbnxm/kernels_simd_2xmm/kernel_ElecQSTabTwinCut_VdwLJFSw_F.cpp.o
542
[ 22%] Building CXX object src/gromacs/CMakeFiles/libgromacs.dir/nbnxm/kernels_simd_2xmm/kernel_ElecQSTabTwinCut_VdwLJFSw_VF.cpp.o
543
[ 22%] Building CXX object src/gromacs/CMakeFiles/libgromacs.dir/nbnxm/kernels_simd_2xmm/kernel_ElecQSTabTwinCut_VdwLJFSw_VgrpF.cpp.o
544
[ 22%] Building CXX object src/gromacs/CMakeFiles/libgromacs.dir/nbnxm/kernels_simd_2xmm/kernel_ElecQSTabTwinCut_VdwLJPSw_F.cpp.o
545
[ 22%] Building CXX object src/gromacs/CMakeFiles/libgromacs.dir/nbnxm/kernels_simd_2xmm/kernel_ElecQSTabTwinCut_VdwLJPSw_VF.cpp.o
546
[ 22%] Building CXX object src/gromacs/CMakeFiles/libgromacs.dir/nbnxm/kernels_simd_2xmm/kernel_ElecQSTabTwinCut_VdwLJPSw_VgrpF.cpp.o
547
[ 22%] Building CXX object src/gromacs/CMakeFiles/libgromacs.dir/nbnxm/kernels_simd_2xmm/kernel_ElecQSTabTwinCut_VdwLJ_F.cpp.o
548
[ 22%] Building CXX object src/gromacs/CMakeFiles/libgromacs.dir/nbnxm/kernels_simd_2xmm/kernel_ElecQSTabTwinCut_VdwLJ_VF.cpp.o
549
[ 22%] Building CXX object src/gromacs/CMakeFiles/libgromacs.dir/nbnxm/kernels_simd_2xmm/kernel_ElecQSTabTwinCut_VdwLJ_VgrpF.cpp.o
550
[ 22%] Building CXX object src/gromacs/CMakeFiles/libgromacs.dir/nbnxm/kernels_simd_2xmm/kernel_ElecQSTab_VdwLJCombGeom_F.cpp.o
551
[ 22%] Building CXX object src/gromacs/CMakeFiles/libgromacs.dir/nbnxm/kernels_simd_2xmm/kernel_ElecQSTab_VdwLJCombGeom_VF.cpp.o
552
[ 22%] Building CXX object src/gromacs/CMakeFiles/libgromacs.dir/nbnxm/kernels_simd_2xmm/kernel_ElecQSTab_VdwLJCombGeom_VgrpF.cpp.o
553
[ 24%] Building CXX object src/gromacs/CMakeFiles/libgromacs.dir/nbnxm/kernels_simd_2xmm/kernel_ElecQSTab_VdwLJCombLB_F.cpp.o
554
[ 24%] Building CXX object src/gromacs/CMakeFiles/libgromacs.dir/nbnxm/kernels_simd_2xmm/kernel_ElecQSTab_VdwLJCombLB_VF.cpp.o
555
[ 24%] Building CXX object src/gromacs/CMakeFiles/libgromacs.dir/nbnxm/kernels_simd_2xmm/kernel_ElecQSTab_VdwLJCombLB_VgrpF.cpp.o
556
[ 24%] Building CXX object src/gromacs/CMakeFiles/libgromacs.dir/nbnxm/kernels_simd_2xmm/kernel_ElecQSTab_VdwLJEwCombGeom_F.cpp.o
557
[ 24%] Building CXX object src/gromacs/CMakeFiles/libgromacs.dir/nbnxm/kernels_simd_2xmm/kernel_ElecQSTab_VdwLJEwCombGeom_VF.cpp.o
558
[ 24%] Building CXX object src/gromacs/CMakeFiles/libgromacs.dir/nbnxm/kernels_simd_2xmm/kernel_ElecQSTab_VdwLJEwCombGeom_VgrpF.cpp.o
559
[ 24%] Building CXX object src/gromacs/CMakeFiles/libgromacs.dir/nbnxm/kernels_simd_2xmm/kernel_ElecQSTab_VdwLJFSw_F.cpp.o
560
[ 24%] Building CXX object src/gromacs/CMakeFiles/libgromacs.dir/nbnxm/kernels_simd_2xmm/kernel_ElecQSTab_VdwLJFSw_VF.cpp.o
561
[ 24%] Building CXX object src/gromacs/CMakeFiles/libgromacs.dir/nbnxm/kernels_simd_2xmm/kernel_ElecQSTab_VdwLJFSw_VgrpF.cpp.o
562
[ 24%] Building CXX object src/gromacs/CMakeFiles/libgromacs.dir/nbnxm/kernels_simd_2xmm/kernel_ElecQSTab_VdwLJPSw_F.cpp.o
563
[ 24%] Building CXX object src/gromacs/CMakeFiles/libgromacs.dir/nbnxm/kernels_simd_2xmm/kernel_ElecQSTab_VdwLJPSw_VF.cpp.o
564
[ 24%] Building CXX object src/gromacs/CMakeFiles/libgromacs.dir/nbnxm/kernels_simd_2xmm/kernel_ElecQSTab_VdwLJPSw_VgrpF.cpp.o
565
[ 24%] Building CXX object src/gromacs/CMakeFiles/libgromacs.dir/nbnxm/kernels_simd_2xmm/kernel_ElecQSTab_VdwLJ_F.cpp.o
566
[ 24%] Building CXX object src/gromacs/CMakeFiles/libgromacs.dir/nbnxm/kernels_simd_2xmm/kernel_ElecQSTab_VdwLJ_VF.cpp.o
567
[ 25%] Building CXX object src/gromacs/CMakeFiles/libgromacs.dir/nbnxm/kernels_simd_2xmm/kernel_ElecQSTab_VdwLJ_VgrpF.cpp.o
568
[ 25%] Building CXX object src/gromacs/CMakeFiles/libgromacs.dir/nbnxm/kernels_simd_2xmm/kernel_ElecRF_VdwLJCombGeom_F.cpp.o
569
[ 25%] Building CXX object src/gromacs/CMakeFiles/libgromacs.dir/nbnxm/kernels_simd_2xmm/kernel_ElecRF_VdwLJCombGeom_VF.cpp.o
570
[ 25%] Building CXX object src/gromacs/CMakeFiles/libgromacs.dir/nbnxm/kernels_simd_2xmm/kernel_ElecRF_VdwLJCombGeom_VgrpF.cpp.o
571
[ 25%] Building CXX object src/gromacs/CMakeFiles/libgromacs.dir/nbnxm/kernels_simd_2xmm/kernel_ElecRF_VdwLJCombLB_F.cpp.o
572
[ 25%] Building CXX object src/gromacs/CMakeFiles/libgromacs.dir/nbnxm/kernels_simd_2xmm/kernel_ElecRF_VdwLJCombLB_VF.cpp.o
573
[ 25%] Building CXX object src/gromacs/CMakeFiles/libgromacs.dir/nbnxm/kernels_simd_2xmm/kernel_ElecRF_VdwLJCombLB_VgrpF.cpp.o
574
[ 25%] Building CXX object src/gromacs/CMakeFiles/libgromacs.dir/nbnxm/kernels_simd_2xmm/kernel_ElecRF_VdwLJEwCombGeom_F.cpp.o
575
[ 25%] Building CXX object src/gromacs/CMakeFiles/libgromacs.dir/nbnxm/kernels_simd_2xmm/kernel_ElecRF_VdwLJEwCombGeom_VF.cpp.o
576
[ 25%] Building CXX object src/gromacs/CMakeFiles/libgromacs.dir/nbnxm/kernels_simd_2xmm/kernel_ElecRF_VdwLJEwCombGeom_VgrpF.cpp.o
577
[ 25%] Building CXX object src/gromacs/CMakeFiles/libgromacs.dir/nbnxm/kernels_simd_2xmm/kernel_ElecRF_VdwLJFSw_F.cpp.o
578
[ 25%] Building CXX object src/gromacs/CMakeFiles/libgromacs.dir/nbnxm/kernels_simd_2xmm/kernel_ElecRF_VdwLJFSw_VF.cpp.o
579
[ 25%] Building CXX object src/gromacs/CMakeFiles/libgromacs.dir/nbnxm/kernels_simd_2xmm/kernel_ElecRF_VdwLJFSw_VgrpF.cpp.o
580
[ 25%] Building CXX object src/gromacs/CMakeFiles/libgromacs.dir/nbnxm/kernels_simd_2xmm/kernel_ElecRF_VdwLJPSw_F.cpp.o
581
[ 25%] Building CXX object src/gromacs/CMakeFiles/libgromacs.dir/nbnxm/kernels_simd_2xmm/kernel_ElecRF_VdwLJPSw_VF.cpp.o
582
[ 27%] Building CXX object src/gromacs/CMakeFiles/libgromacs.dir/nbnxm/kernels_simd_2xmm/kernel_ElecRF_VdwLJPSw_VgrpF.cpp.o
583
[ 27%] Building CXX object src/gromacs/CMakeFiles/libgromacs.dir/nbnxm/kernels_simd_2xmm/kernel_ElecRF_VdwLJ_F.cpp.o
584
[ 27%] Building CXX object src/gromacs/CMakeFiles/libgromacs.dir/nbnxm/kernels_simd_2xmm/kernel_ElecRF_VdwLJ_VF.cpp.o
585
[ 27%] Building CXX object src/gromacs/CMakeFiles/libgromacs.dir/nbnxm/kernels_simd_2xmm/kernel_ElecRF_VdwLJ_VgrpF.cpp.o
586
[ 27%] Building CXX object src/gromacs/CMakeFiles/libgromacs.dir/nbnxm/kernels_simd_2xmm/kernel_prune.cpp.o
587
[ 27%] Building CXX object src/gromacs/CMakeFiles/libgromacs.dir/nbnxm/kernels_simd_4xm/kernel_ElecEwTwinCut_VdwLJCombGeom_F.cpp.o
588
[ 27%] Building CXX object src/gromacs/CMakeFiles/libgromacs.dir/nbnxm/kernels_simd_4xm/kernel_ElecEwTwinCut_VdwLJCombGeom_VF.cpp.o
589
[ 27%] Building CXX object src/gromacs/CMakeFiles/libgromacs.dir/nbnxm/kernels_simd_4xm/kernel_ElecEwTwinCut_VdwLJCombGeom_VgrpF.cpp.o
590
[ 27%] Building CXX object src/gromacs/CMakeFiles/libgromacs.dir/nbnxm/kernels_simd_4xm/kernel_ElecEwTwinCut_VdwLJCombLB_F.cpp.o
591
[ 27%] Building CXX object src/gromacs/CMakeFiles/libgromacs.dir/nbnxm/kernels_simd_4xm/kernel_ElecEwTwinCut_VdwLJCombLB_VF.cpp.o
592
[ 27%] Building CXX object src/gromacs/CMakeFiles/libgromacs.dir/nbnxm/kernels_simd_4xm/kernel_ElecEwTwinCut_VdwLJCombLB_VgrpF.cpp.o
593
[ 27%] Building CXX object src/gromacs/CMakeFiles/libgromacs.dir/nbnxm/kernels_simd_4xm/kernel_ElecEwTwinCut_VdwLJEwCombGeom_F.cpp.o
594
[ 27%] Building CXX object src/gromacs/CMakeFiles/libgromacs.dir/nbnxm/kernels_simd_4xm/kernel_ElecEwTwinCut_VdwLJEwCombGeom_VF.cpp.o
595
[ 27%] Building CXX object src/gromacs/CMakeFiles/libgromacs.dir/nbnxm/kernels_simd_4xm/kernel_ElecEwTwinCut_VdwLJEwCombGeom_VgrpF.cpp.o
596
[ 29%] Building CXX object src/gromacs/CMakeFiles/libgromacs.dir/nbnxm/kernels_simd_4xm/kernel_ElecEwTwinCut_VdwLJFSw_F.cpp.o
597
[ 29%] Building CXX object src/gromacs/CMakeFiles/libgromacs.dir/nbnxm/kernels_simd_4xm/kernel_ElecEwTwinCut_VdwLJFSw_VF.cpp.o
598
[ 29%] Building CXX object src/gromacs/CMakeFiles/libgromacs.dir/nbnxm/kernels_simd_4xm/kernel_ElecEwTwinCut_VdwLJFSw_VgrpF.cpp.o
599
[ 29%] Building CXX object src/gromacs/CMakeFiles/libgromacs.dir/nbnxm/kernels_simd_4xm/kernel_ElecEwTwinCut_VdwLJPSw_F.cpp.o
600
[ 29%] Building CXX object src/gromacs/CMakeFiles/libgromacs.dir/nbnxm/kernels_simd_4xm/kernel_ElecEwTwinCut_VdwLJPSw_VF.cpp.o
601
[ 29%] Building CXX object src/gromacs/CMakeFiles/libgromacs.dir/nbnxm/kernels_simd_4xm/kernel_ElecEwTwinCut_VdwLJPSw_VgrpF.cpp.o
602
[ 29%] Building CXX object src/gromacs/CMakeFiles/libgromacs.dir/nbnxm/kernels_simd_4xm/kernel_ElecEwTwinCut_VdwLJ_F.cpp.o
603
[ 29%] Building CXX object src/gromacs/CMakeFiles/libgromacs.dir/nbnxm/kernels_simd_4xm/kernel_ElecEwTwinCut_VdwLJ_VF.cpp.o
604
[ 29%] Building CXX object src/gromacs/CMakeFiles/libgromacs.dir/nbnxm/kernels_simd_4xm/kernel_ElecEwTwinCut_VdwLJ_VgrpF.cpp.o
605
[ 29%] Building CXX object src/gromacs/CMakeFiles/libgromacs.dir/nbnxm/kernels_simd_4xm/kernel_ElecEw_VdwLJCombGeom_F.cpp.o
606
[ 29%] Building CXX object src/gromacs/CMakeFiles/libgromacs.dir/nbnxm/kernels_simd_4xm/kernel_ElecEw_VdwLJCombGeom_VF.cpp.o
607
[ 29%] Building CXX object src/gromacs/CMakeFiles/libgromacs.dir/nbnxm/kernels_simd_4xm/kernel_ElecEw_VdwLJCombGeom_VgrpF.cpp.o
608
[ 29%] Building CXX object src/gromacs/CMakeFiles/libgromacs.dir/nbnxm/kernels_simd_4xm/kernel_ElecEw_VdwLJCombLB_F.cpp.o
609
[ 29%] Building CXX object src/gromacs/CMakeFiles/libgromacs.dir/nbnxm/kernels_simd_4xm/kernel_ElecEw_VdwLJCombLB_VF.cpp.o
610
[ 29%] Building CXX object src/gromacs/CMakeFiles/libgromacs.dir/nbnxm/kernels_simd_4xm/kernel_ElecEw_VdwLJCombLB_VgrpF.cpp.o
611
[ 30%] Building CXX object src/gromacs/CMakeFiles/libgromacs.dir/nbnxm/kernels_simd_4xm/kernel_ElecEw_VdwLJEwCombGeom_F.cpp.o
612
[ 30%] Building CXX object src/gromacs/CMakeFiles/libgromacs.dir/nbnxm/kernels_simd_4xm/kernel_ElecEw_VdwLJEwCombGeom_VF.cpp.o
613
[ 30%] Building CXX object src/gromacs/CMakeFiles/libgromacs.dir/nbnxm/kernels_simd_4xm/kernel_ElecEw_VdwLJEwCombGeom_VgrpF.cpp.o
614
[ 30%] Building CXX object src/gromacs/CMakeFiles/libgromacs.dir/nbnxm/kernels_simd_4xm/kernel_ElecEw_VdwLJFSw_F.cpp.o
615
[ 30%] Building CXX object src/gromacs/CMakeFiles/libgromacs.dir/nbnxm/kernels_simd_4xm/kernel_ElecEw_VdwLJFSw_VF.cpp.o
616
[ 30%] Building CXX object src/gromacs/CMakeFiles/libgromacs.dir/nbnxm/kernels_simd_4xm/kernel_ElecEw_VdwLJFSw_VgrpF.cpp.o
617
[ 30%] Building CXX object src/gromacs/CMakeFiles/libgromacs.dir/nbnxm/kernels_simd_4xm/kernel_ElecEw_VdwLJPSw_F.cpp.o
618
[ 30%] Building CXX object src/gromacs/CMakeFiles/libgromacs.dir/nbnxm/kernels_simd_4xm/kernel_ElecEw_VdwLJPSw_VF.cpp.o
619
[ 30%] Building CXX object src/gromacs/CMakeFiles/libgromacs.dir/nbnxm/kernels_simd_4xm/kernel_ElecEw_VdwLJPSw_VgrpF.cpp.o
620
[ 30%] Building CXX object src/gromacs/CMakeFiles/libgromacs.dir/nbnxm/kernels_simd_4xm/kernel_ElecEw_VdwLJ_F.cpp.o
621
[ 30%] Building CXX object src/gromacs/CMakeFiles/libgromacs.dir/nbnxm/kernels_simd_4xm/kernel_ElecEw_VdwLJ_VF.cpp.o
622
[ 30%] Building CXX object src/gromacs/CMakeFiles/libgromacs.dir/nbnxm/kernels_simd_4xm/kernel_ElecEw_VdwLJ_VgrpF.cpp.o
623
[ 30%] Building CXX object src/gromacs/CMakeFiles/libgromacs.dir/nbnxm/kernels_simd_4xm/kernel_ElecQSTabTwinCut_VdwLJCombGeom_F.cpp.o
624
[ 30%] Building CXX object src/gromacs/CMakeFiles/libgromacs.dir/nbnxm/kernels_simd_4xm/kernel_ElecQSTabTwinCut_VdwLJCombGeom_VF.cpp.o
625
[ 32%] Building CXX object src/gromacs/CMakeFiles/libgromacs.dir/nbnxm/kernels_simd_4xm/kernel_ElecQSTabTwinCut_VdwLJCombGeom_VgrpF.cpp.o
626
[ 32%] Building CXX object src/gromacs/CMakeFiles/libgromacs.dir/nbnxm/kernels_simd_4xm/kernel_ElecQSTabTwinCut_VdwLJCombLB_F.cpp.o
627
[ 32%] Building CXX object src/gromacs/CMakeFiles/libgromacs.dir/nbnxm/kernels_simd_4xm/kernel_ElecQSTabTwinCut_VdwLJCombLB_VF.cpp.o
628
[ 32%] Building CXX object src/gromacs/CMakeFiles/libgromacs.dir/nbnxm/kernels_simd_4xm/kernel_ElecQSTabTwinCut_VdwLJCombLB_VgrpF.cpp.o
629
[ 32%] Building CXX object src/gromacs/CMakeFiles/libgromacs.dir/nbnxm/kernels_simd_4xm/kernel_ElecQSTabTwinCut_VdwLJEwCombGeom_F.cpp.o
630
[ 32%] Building CXX object src/gromacs/CMakeFiles/libgromacs.dir/nbnxm/kernels_simd_4xm/kernel_ElecQSTabTwinCut_VdwLJEwCombGeom_VF.cpp.o
631
[ 32%] Building CXX object src/gromacs/CMakeFiles/libgromacs.dir/nbnxm/kernels_simd_4xm/kernel_ElecQSTabTwinCut_VdwLJEwCombGeom_VgrpF.cpp.o
632
[ 32%] Building CXX object src/gromacs/CMakeFiles/libgromacs.dir/nbnxm/kernels_simd_4xm/kernel_ElecQSTabTwinCut_VdwLJFSw_F.cpp.o
633
[ 32%] Building CXX object src/gromacs/CMakeFiles/libgromacs.dir/nbnxm/kernels_simd_4xm/kernel_ElecQSTabTwinCut_VdwLJFSw_VF.cpp.o
634
[ 32%] Building CXX object src/gromacs/CMakeFiles/libgromacs.dir/nbnxm/kernels_simd_4xm/kernel_ElecQSTabTwinCut_VdwLJFSw_VgrpF.cpp.o
635
[ 32%] Building CXX object src/gromacs/CMakeFiles/libgromacs.dir/nbnxm/kernels_simd_4xm/kernel_ElecQSTabTwinCut_VdwLJPSw_F.cpp.o
636
[ 32%] Building CXX object src/gromacs/CMakeFiles/libgromacs.dir/nbnxm/kernels_simd_4xm/kernel_ElecQSTabTwinCut_VdwLJPSw_VF.cpp.o
637
[ 32%] Building CXX object src/gromacs/CMakeFiles/libgromacs.dir/nbnxm/kernels_simd_4xm/kernel_ElecQSTabTwinCut_VdwLJPSw_VgrpF.cpp.o
638
[ 32%] Building CXX object src/gromacs/CMakeFiles/libgromacs.dir/nbnxm/kernels_simd_4xm/kernel_ElecQSTabTwinCut_VdwLJ_F.cpp.o
639
[ 33%] Building CXX object src/gromacs/CMakeFiles/libgromacs.dir/nbnxm/kernels_simd_4xm/kernel_ElecQSTabTwinCut_VdwLJ_VF.cpp.o
640
[ 33%] Building CXX object src/gromacs/CMakeFiles/libgromacs.dir/nbnxm/kernels_simd_4xm/kernel_ElecQSTabTwinCut_VdwLJ_VgrpF.cpp.o
641
[ 33%] Building CXX object src/gromacs/CMakeFiles/libgromacs.dir/nbnxm/kernels_simd_4xm/kernel_ElecQSTab_VdwLJCombGeom_F.cpp.o
642
[ 33%] Building CXX object src/gromacs/CMakeFiles/libgromacs.dir/nbnxm/kernels_simd_4xm/kernel_ElecQSTab_VdwLJCombGeom_VF.cpp.o
643
[ 33%] Building CXX object src/gromacs/CMakeFiles/libgromacs.dir/nbnxm/kernels_simd_4xm/kernel_ElecQSTab_VdwLJCombGeom_VgrpF.cpp.o
644
[ 33%] Building CXX object src/gromacs/CMakeFiles/libgromacs.dir/nbnxm/kernels_simd_4xm/kernel_ElecQSTab_VdwLJCombLB_F.cpp.o
645
[ 33%] Building CXX object src/gromacs/CMakeFiles/libgromacs.dir/nbnxm/kernels_simd_4xm/kernel_ElecQSTab_VdwLJCombLB_VF.cpp.o
646
[ 33%] Building CXX object src/gromacs/CMakeFiles/libgromacs.dir/nbnxm/kernels_simd_4xm/kernel_ElecQSTab_VdwLJCombLB_VgrpF.cpp.o
647
[ 33%] Building CXX object src/gromacs/CMakeFiles/libgromacs.dir/nbnxm/kernels_simd_4xm/kernel_ElecQSTab_VdwLJEwCombGeom_F.cpp.o
648
[ 33%] Building CXX object src/gromacs/CMakeFiles/libgromacs.dir/nbnxm/kernels_simd_4xm/kernel_ElecQSTab_VdwLJEwCombGeom_VF.cpp.o
649
[ 33%] Building CXX object src/gromacs/CMakeFiles/libgromacs.dir/nbnxm/kernels_simd_4xm/kernel_ElecQSTab_VdwLJEwCombGeom_VgrpF.cpp.o
650
[ 33%] Building CXX object src/gromacs/CMakeFiles/libgromacs.dir/nbnxm/kernels_simd_4xm/kernel_ElecQSTab_VdwLJFSw_F.cpp.o
651
[ 33%] Building CXX object src/gromacs/CMakeFiles/libgromacs.dir/nbnxm/kernels_simd_4xm/kernel_ElecQSTab_VdwLJFSw_VF.cpp.o
652
[ 33%] Building CXX object src/gromacs/CMakeFiles/libgromacs.dir/nbnxm/kernels_simd_4xm/kernel_ElecQSTab_VdwLJFSw_VgrpF.cpp.o
653
[ 33%] Building CXX object src/gromacs/CMakeFiles/libgromacs.dir/nbnxm/kernels_simd_4xm/kernel_ElecQSTab_VdwLJPSw_F.cpp.o
654
[ 35%] Building CXX object src/gromacs/CMakeFiles/libgromacs.dir/nbnxm/kernels_simd_4xm/kernel_ElecQSTab_VdwLJPSw_VF.cpp.o
655
[ 35%] Building CXX object src/gromacs/CMakeFiles/libgromacs.dir/nbnxm/kernels_simd_4xm/kernel_ElecQSTab_VdwLJPSw_VgrpF.cpp.o
656
[ 35%] Building CXX object src/gromacs/CMakeFiles/libgromacs.dir/nbnxm/kernels_simd_4xm/kernel_ElecQSTab_VdwLJ_F.cpp.o
657
[ 35%] Building CXX object src/gromacs/CMakeFiles/libgromacs.dir/nbnxm/kernels_simd_4xm/kernel_ElecQSTab_VdwLJ_VF.cpp.o
658
[ 35%] Building CXX object src/gromacs/CMakeFiles/libgromacs.dir/nbnxm/kernels_simd_4xm/kernel_ElecQSTab_VdwLJ_VgrpF.cpp.o
659
[ 35%] Building CXX object src/gromacs/CMakeFiles/libgromacs.dir/nbnxm/kernels_simd_4xm/kernel_ElecRF_VdwLJCombGeom_F.cpp.o
660
[ 35%] Building CXX object src/gromacs/CMakeFiles/libgromacs.dir/nbnxm/kernels_simd_4xm/kernel_ElecRF_VdwLJCombGeom_VF.cpp.o
661
[ 35%] Building CXX object src/gromacs/CMakeFiles/libgromacs.dir/nbnxm/kernels_simd_4xm/kernel_ElecRF_VdwLJCombGeom_VgrpF.cpp.o
662
[ 35%] Building CXX object src/gromacs/CMakeFiles/libgromacs.dir/nbnxm/kernels_simd_4xm/kernel_ElecRF_VdwLJCombLB_F.cpp.o
663
[ 35%] Building CXX object src/gromacs/CMakeFiles/libgromacs.dir/nbnxm/kernels_simd_4xm/kernel_ElecRF_VdwLJCombLB_VF.cpp.o
664
[ 35%] Building CXX object src/gromacs/CMakeFiles/libgromacs.dir/nbnxm/kernels_simd_4xm/kernel_ElecRF_VdwLJCombLB_VgrpF.cpp.o
665
[ 35%] Building CXX object src/gromacs/CMakeFiles/libgromacs.dir/nbnxm/kernels_simd_4xm/kernel_ElecRF_VdwLJEwCombGeom_F.cpp.o
666
[ 35%] Building CXX object src/gromacs/CMakeFiles/libgromacs.dir/nbnxm/kernels_simd_4xm/kernel_ElecRF_VdwLJEwCombGeom_VF.cpp.o
667
[ 35%] Building CXX object src/gromacs/CMakeFiles/libgromacs.dir/nbnxm/kernels_simd_4xm/kernel_ElecRF_VdwLJEwCombGeom_VgrpF.cpp.o
668
[ 37%] Building CXX object src/gromacs/CMakeFiles/libgromacs.dir/nbnxm/kernels_simd_4xm/kernel_ElecRF_VdwLJFSw_F.cpp.o
669
[ 37%] Building CXX object src/gromacs/CMakeFiles/libgromacs.dir/nbnxm/kernels_simd_4xm/kernel_ElecRF_VdwLJFSw_VF.cpp.o
670
[ 37%] Building CXX object src/gromacs/CMakeFiles/libgromacs.dir/nbnxm/kernels_simd_4xm/kernel_ElecRF_VdwLJFSw_VgrpF.cpp.o
671
[ 37%] Building CXX object src/gromacs/CMakeFiles/libgromacs.dir/nbnxm/kernels_simd_4xm/kernel_ElecRF_VdwLJPSw_F.cpp.o
672
[ 37%] Building CXX object src/gromacs/CMakeFiles/libgromacs.dir/nbnxm/kernels_simd_4xm/kernel_ElecRF_VdwLJPSw_VF.cpp.o
673
[ 37%] Building CXX object src/gromacs/CMakeFiles/libgromacs.dir/nbnxm/kernels_simd_4xm/kernel_ElecRF_VdwLJPSw_VgrpF.cpp.o
674
[ 37%] Building CXX object src/gromacs/CMakeFiles/libgromacs.dir/nbnxm/kernels_simd_4xm/kernel_ElecRF_VdwLJ_F.cpp.o
675
[ 37%] Building CXX object src/gromacs/CMakeFiles/libgromacs.dir/nbnxm/kernels_simd_4xm/kernel_ElecRF_VdwLJ_VF.cpp.o
676
[ 37%] Building CXX object src/gromacs/CMakeFiles/libgromacs.dir/nbnxm/kernels_simd_4xm/kernel_ElecRF_VdwLJ_VgrpF.cpp.o
677
[ 37%] Building CXX object src/gromacs/CMakeFiles/libgromacs.dir/nbnxm/kernels_simd_4xm/kernel_prune.cpp.o
678
[ 37%] Building CXX object src/gromacs/CMakeFiles/libgromacs.dir/nbnxm/nbnxm.cpp.o
679
[ 37%] Building CXX object src/gromacs/CMakeFiles/libgromacs.dir/nbnxm/nbnxm_geometry.cpp.o
680
[ 37%] Building CXX object src/gromacs/CMakeFiles/libgromacs.dir/nbnxm/nbnxm_setup.cpp.o
681
[ 37%] Building CXX object src/gromacs/CMakeFiles/libgromacs.dir/nbnxm/pairlist.cpp.o
682
[ 37%] Building CXX object src/gromacs/CMakeFiles/libgromacs.dir/nbnxm/pairlist_tuning.cpp.o
683
[ 38%] Building CXX object src/gromacs/CMakeFiles/libgromacs.dir/nbnxm/pairlistparams.cpp.o
684
[ 38%] Building CXX object src/gromacs/CMakeFiles/libgromacs.dir/nbnxm/pairlistset.cpp.o
685
[ 38%] Building CXX object src/gromacs/CMakeFiles/libgromacs.dir/nbnxm/pairsearch.cpp.o
686
[ 38%] Building CXX object src/gromacs/CMakeFiles/libgromacs.dir/nbnxm/prunekerneldispatch.cpp.o
687
[ 38%] Building CXX object src/gromacs/CMakeFiles/libgromacs.dir/nbnxm/opencl/nbnxm_ocl.cpp.o
688
[ 38%] Building CXX object src/gromacs/CMakeFiles/libgromacs.dir/nbnxm/opencl/nbnxm_ocl_data_mgmt.cpp.o
689
[ 38%] Building CXX object src/gromacs/CMakeFiles/libgromacs.dir/nbnxm/opencl/nbnxm_ocl_jit_support.cpp.o
690
[ 38%] Building CXX object src/gromacs/CMakeFiles/libgromacs.dir/commandline/cmdlinehelpcontext.cpp.o
691
[ 38%] Building CXX object src/gromacs/CMakeFiles/libgromacs.dir/commandline/cmdlinehelpmodule.cpp.o
692
[ 38%] Building CXX object src/gromacs/CMakeFiles/libgromacs.dir/commandline/cmdlinehelpwriter.cpp.o
693
[ 38%] Building CXX object src/gromacs/CMakeFiles/libgromacs.dir/commandline/cmdlineinit.cpp.o
694
[ 38%] Building CXX object src/gromacs/CMakeFiles/libgromacs.dir/commandline/cmdlinemodule.cpp.o
695
[ 38%] Building CXX object src/gromacs/CMakeFiles/libgromacs.dir/commandline/cmdlinemodulemanager.cpp.o
696
[ 38%] Building CXX object src/gromacs/CMakeFiles/libgromacs.dir/commandline/cmdlineoptionsmodule.cpp.o
697
[ 40%] Building CXX object src/gromacs/CMakeFiles/libgromacs.dir/commandline/cmdlineparser.cpp.o
698
[ 40%] Building CXX object src/gromacs/CMakeFiles/libgromacs.dir/commandline/cmdlineprogramcontext.cpp.o
699
[ 40%] Building CXX object src/gromacs/CMakeFiles/libgromacs.dir/commandline/filenm.cpp.o
700
[ 40%] Building CXX object src/gromacs/CMakeFiles/libgromacs.dir/commandline/pargs.cpp.o
701
[ 40%] Building CXX object src/gromacs/CMakeFiles/libgromacs.dir/commandline/shellcompletions.cpp.o
702
[ 40%] Building CXX object src/gromacs/CMakeFiles/libgromacs.dir/commandline/viewit.cpp.o
703
[ 40%] Building CXX object src/gromacs/CMakeFiles/libgromacs.dir/domdec/atomdistribution.cpp.o
704
[ 40%] Building CXX object src/gromacs/CMakeFiles/libgromacs.dir/domdec/box.cpp.o
705
[ 40%] Building CXX object src/gromacs/CMakeFiles/libgromacs.dir/domdec/cellsizes.cpp.o
706
[ 40%] Building CXX object src/gromacs/CMakeFiles/libgromacs.dir/domdec/collect.cpp.o
707
[ 40%] Building CXX object src/gromacs/CMakeFiles/libgromacs.dir/domdec/distribute.cpp.o
708
[ 40%] Building CXX object src/gromacs/CMakeFiles/libgromacs.dir/domdec/dlb.cpp.o
709
[ 40%] Building CXX object src/gromacs/CMakeFiles/libgromacs.dir/domdec/dlbtiming.cpp.o
710
[ 40%] Building CXX object src/gromacs/CMakeFiles/libgromacs.dir/domdec/domdec.cpp.o
711
[ 40%] Building CXX object src/gromacs/CMakeFiles/libgromacs.dir/domdec/domdec_constraints.cpp.o
712
[ 41%] Building CXX object src/gromacs/CMakeFiles/libgromacs.dir/domdec/domdec_network.cpp.o
713
[ 41%] Building CXX object src/gromacs/CMakeFiles/libgromacs.dir/domdec/domdec_setup.cpp.o
714
[ 41%] Building CXX object src/gromacs/CMakeFiles/libgromacs.dir/domdec/domdec_specatomcomm.cpp.o
715
[ 41%] Building CXX object src/gromacs/CMakeFiles/libgromacs.dir/domdec/domdec_topology.cpp.o
716
[ 41%] Building CXX object src/gromacs/CMakeFiles/libgromacs.dir/domdec/domdec_vsite.cpp.o
717
[ 41%] Building CXX object src/gromacs/CMakeFiles/libgromacs.dir/domdec/dump.cpp.o
718
[ 41%] Building CXX object src/gromacs/CMakeFiles/libgromacs.dir/domdec/ga2la.cpp.o
719
[ 41%] Building CXX object src/gromacs/CMakeFiles/libgromacs.dir/domdec/gpuhaloexchange_impl.cpp.o
720
[ 41%] Building CXX object src/gromacs/CMakeFiles/libgromacs.dir/domdec/localatomset.cpp.o
721
[ 41%] Building CXX object src/gromacs/CMakeFiles/libgromacs.dir/domdec/localatomsetdata.cpp.o
722
[ 41%] Building CXX object src/gromacs/CMakeFiles/libgromacs.dir/domdec/localatomsetmanager.cpp.o
723
[ 41%] Building CXX object src/gromacs/CMakeFiles/libgromacs.dir/domdec/mdsetup.cpp.o
724
[ 41%] Building CXX object src/gromacs/CMakeFiles/libgromacs.dir/domdec/partition.cpp.o
725
[ 41%] Building CXX object src/gromacs/CMakeFiles/libgromacs.dir/domdec/redistribute.cpp.o
726
[ 43%] Building CXX object src/gromacs/CMakeFiles/libgromacs.dir/domdec/utility.cpp.o
727
[ 43%] Building CXX object src/gromacs/CMakeFiles/libgromacs.dir/math/3dtransforms.cpp.o
728
[ 43%] Building CXX object src/gromacs/CMakeFiles/libgromacs.dir/math/coordinatetransformation.cpp.o
729
[ 43%] Building CXX object src/gromacs/CMakeFiles/libgromacs.dir/math/densityfit.cpp.o
730
[ 43%] Building CXX object src/gromacs/CMakeFiles/libgromacs.dir/math/densityfittingforce.cpp.o
731
[ 43%] Building CXX object src/gromacs/CMakeFiles/libgromacs.dir/math/do_fit.cpp.o
732
[ 43%] Building CXX object src/gromacs/CMakeFiles/libgromacs.dir/math/exponentialmovingaverage.cpp.o
733
[ 43%] Building CXX object src/gromacs/CMakeFiles/libgromacs.dir/math/functions.cpp.o
734
[ 43%] Building CXX object src/gromacs/CMakeFiles/libgromacs.dir/math/gausstransform.cpp.o
735
[ 43%] Building CXX object src/gromacs/CMakeFiles/libgromacs.dir/math/invertmatrix.cpp.o
736
[ 43%] Building CXX object src/gromacs/CMakeFiles/libgromacs.dir/math/units.cpp.o
737
[ 43%] Building CXX object src/gromacs/CMakeFiles/libgromacs.dir/math/utilities.cpp.o
738
[ 43%] Building CXX object src/gromacs/CMakeFiles/libgromacs.dir/math/veccompare.cpp.o
739
[ 43%] Building CXX object src/gromacs/CMakeFiles/libgromacs.dir/math/vecdump.cpp.o
740
[ 45%] Building CXX object src/gromacs/CMakeFiles/libgromacs.dir/mdtypes/df_history.cpp.o
741
[ 45%] Building CXX object src/gromacs/CMakeFiles/libgromacs.dir/mdtypes/group.cpp.o
742
[ 45%] Building CXX object src/gromacs/CMakeFiles/libgromacs.dir/mdtypes/iforceprovider.cpp.o
743
[ 45%] Building CXX object src/gromacs/CMakeFiles/libgromacs.dir/mdtypes/inputrec.cpp.o
744
[ 45%] Building CXX object src/gromacs/CMakeFiles/libgromacs.dir/mdtypes/md_enums.cpp.o
745
[ 45%] Building CXX object src/gromacs/CMakeFiles/libgromacs.dir/mdtypes/observableshistory.cpp.o
746
[ 45%] Building CXX object src/gromacs/CMakeFiles/libgromacs.dir/mdtypes/state.cpp.o
747
[ 45%] Building CXX object src/gromacs/CMakeFiles/libgromacs.dir/onlinehelp/helpformat.cpp.o
748
[ 45%] Building CXX object src/gromacs/CMakeFiles/libgromacs.dir/onlinehelp/helpmanager.cpp.o
749
[ 45%] Building CXX object src/gromacs/CMakeFiles/libgromacs.dir/onlinehelp/helptopic.cpp.o
750
[ 45%] Building CXX object src/gromacs/CMakeFiles/libgromacs.dir/onlinehelp/helpwritercontext.cpp.o
751
[ 45%] Building CXX object src/gromacs/CMakeFiles/libgromacs.dir/onlinehelp/rstparser.cpp.o
752
[ 45%] Building CXX object src/gromacs/CMakeFiles/libgromacs.dir/pbcutil/boxutilities.cpp.o
753
[ 45%] Building CXX object src/gromacs/CMakeFiles/libgromacs.dir/pbcutil/mshift.cpp.o
754
[ 45%] Building CXX object src/gromacs/CMakeFiles/libgromacs.dir/pbcutil/pbc.cpp.o
755
[ 46%] Building CXX object src/gromacs/CMakeFiles/libgromacs.dir/pbcutil/pbc_simd.cpp.o
756
[ 46%] Building CXX object src/gromacs/CMakeFiles/libgromacs.dir/pbcutil/pbcenums.cpp.o
757
[ 46%] Building CXX object src/gromacs/CMakeFiles/libgromacs.dir/pbcutil/pbcmethods.cpp.o
758
[ 46%] Building CXX object src/gromacs/CMakeFiles/libgromacs.dir/pbcutil/rmpbc.cpp.o
759
[ 46%] Building CXX object src/gromacs/CMakeFiles/libgromacs.dir/random/seed.cpp.o
760
[ 46%] Building CXX object src/gromacs/CMakeFiles/libgromacs.dir/random/tabulatednormaldistribution.cpp.o
761
[ 46%] Building CXX object src/gromacs/CMakeFiles/libgromacs.dir/tables/cubicsplinetable.cpp.o
762
[ 46%] Building CXX object src/gromacs/CMakeFiles/libgromacs.dir/tables/forcetable.cpp.o
763
[ 46%] Building CXX object src/gromacs/CMakeFiles/libgromacs.dir/tables/quadraticsplinetable.cpp.o
764
[ 46%] Building CXX object src/gromacs/CMakeFiles/libgromacs.dir/tables/splineutil.cpp.o
765
[ 46%] Building CXX object src/gromacs/CMakeFiles/libgromacs.dir/timing/cyclecounter.cpp.o
766
[ 46%] Building CXX object src/gromacs/CMakeFiles/libgromacs.dir/timing/wallcycle.cpp.o
767
[ 46%] Building CXX object src/gromacs/CMakeFiles/libgromacs.dir/timing/walltime_accounting.cpp.o
768
[ 46%] Building CXX object src/gromacs/CMakeFiles/libgromacs.dir/topology/atomprop.cpp.o
769
[ 48%] Building CXX object src/gromacs/CMakeFiles/libgromacs.dir/topology/atoms.cpp.o
770
[ 48%] Building CXX object src/gromacs/CMakeFiles/libgromacs.dir/topology/atomsbuilder.cpp.o
771
[ 48%] Building CXX object src/gromacs/CMakeFiles/libgromacs.dir/topology/block.cpp.o
772
[ 48%] Building CXX object src/gromacs/CMakeFiles/libgromacs.dir/topology/exclusionblocks.cpp.o
773
[ 48%] Building CXX object src/gromacs/CMakeFiles/libgromacs.dir/topology/forcefieldparameters.cpp.o
774
[ 48%] Building CXX object src/gromacs/CMakeFiles/libgromacs.dir/topology/idef.cpp.o
775
[ 48%] Building CXX object src/gromacs/CMakeFiles/libgromacs.dir/topology/ifunc.cpp.o
776
[ 48%] Building CXX object src/gromacs/CMakeFiles/libgromacs.dir/topology/index.cpp.o
777
[ 48%] Building CXX object src/gromacs/CMakeFiles/libgromacs.dir/topology/invblock.cpp.o
778
[ 48%] Building CXX object src/gromacs/CMakeFiles/libgromacs.dir/topology/mtop_util.cpp.o
779
[ 48%] Building CXX object src/gromacs/CMakeFiles/libgromacs.dir/topology/residuetypes.cpp.o
780
[ 48%] Building CXX object src/gromacs/CMakeFiles/libgromacs.dir/topology/symtab.cpp.o
781
[ 48%] Building CXX object src/gromacs/CMakeFiles/libgromacs.dir/topology/topology.cpp.o
782
[ 48%] Building CXX object src/gromacs/CMakeFiles/libgromacs.dir/topology/topsort.cpp.o
783
[ 48%] Building CXX object src/gromacs/CMakeFiles/libgromacs.dir/swap/swapcoords.cpp.o
784
[ 50%] Building CXX object src/gromacs/CMakeFiles/libgromacs.dir/essentialdynamics/edsam.cpp.o
785
[ 50%] Building CXX object src/gromacs/CMakeFiles/libgromacs.dir/pulling/output.cpp.o
786
[ 50%] Building CXX object src/gromacs/CMakeFiles/libgromacs.dir/pulling/pull.cpp.o
787
[ 50%] Building CXX object src/gromacs/CMakeFiles/libgromacs.dir/pulling/pull_rotation.cpp.o
788
[ 50%] Building CXX object src/gromacs/CMakeFiles/libgromacs.dir/pulling/pullutil.cpp.o
789
[ 50%] Building CXX object src/gromacs/CMakeFiles/libgromacs.dir/awh/awh.cpp.o
790
[ 50%] Building CXX object src/gromacs/CMakeFiles/libgromacs.dir/awh/bias.cpp.o
791
[ 50%] Building CXX object src/gromacs/CMakeFiles/libgromacs.dir/awh/biasparams.cpp.o
792
[ 50%] Building CXX object src/gromacs/CMakeFiles/libgromacs.dir/awh/biassharing.cpp.o
793
[ 50%] Building CXX object src/gromacs/CMakeFiles/libgromacs.dir/awh/biasstate.cpp.o
794
[ 50%] Building CXX object src/gromacs/CMakeFiles/libgromacs.dir/awh/biaswriter.cpp.o
795
[ 50%] Building CXX object src/gromacs/CMakeFiles/libgromacs.dir/awh/coordstate.cpp.o
796
[ 50%] Building CXX object src/gromacs/CMakeFiles/libgromacs.dir/awh/correlationgrid.cpp.o
797
[ 50%] Building CXX object src/gromacs/CMakeFiles/libgromacs.dir/awh/correlationhistory.cpp.o
798
[ 51%] Building CXX object src/gromacs/CMakeFiles/libgromacs.dir/awh/correlationtensor.cpp.o
799
[ 51%] Building CXX object src/gromacs/CMakeFiles/libgromacs.dir/awh/grid.cpp.o
800
[ 51%] Building CXX object src/gromacs/CMakeFiles/libgromacs.dir/awh/histogramsize.cpp.o
801
[ 51%] Building CXX object src/gromacs/CMakeFiles/libgromacs.dir/awh/pointstate.cpp.o
802
[ 51%] Building CXX object src/gromacs/CMakeFiles/libgromacs.dir/awh/read_params.cpp.o
803
[ 51%] Building CXX object src/gromacs/CMakeFiles/libgromacs.dir/simd/support.cpp.o
804
[ 51%] Building CXX object src/gromacs/CMakeFiles/libgromacs.dir/imd/imd.cpp.o
805
[ 51%] Building CXX object src/gromacs/CMakeFiles/libgromacs.dir/imd/imdsocket.cpp.o
806
[ 51%] Building CXX object src/gromacs/CMakeFiles/libgromacs.dir/gmxana/anadih.cpp.o
807
[ 51%] Building CXX object src/gromacs/CMakeFiles/libgromacs.dir/gmxana/angle_correction.cpp.o
808
[ 51%] Building CXX object src/gromacs/CMakeFiles/libgromacs.dir/gmxana/binsearch.cpp.o
809
[ 51%] Building CXX object src/gromacs/CMakeFiles/libgromacs.dir/gmxana/cmat.cpp.o
810
[ 51%] Building CXX object src/gromacs/CMakeFiles/libgromacs.dir/gmxana/dens_filter.cpp.o
811
[ 51%] Building CXX object src/gromacs/CMakeFiles/libgromacs.dir/gmxana/dlist.cpp.o
812
[ 53%] Building CXX object src/gromacs/CMakeFiles/libgromacs.dir/gmxana/eigio.cpp.o
813
[ 53%] Building CXX object src/gromacs/CMakeFiles/libgromacs.dir/gmxana/fitahx.cpp.o
814
[ 53%] Building CXX object src/gromacs/CMakeFiles/libgromacs.dir/gmxana/gmx_anaeig.cpp.o
815
[ 53%] Building CXX object src/gromacs/CMakeFiles/libgromacs.dir/gmxana/gmx_analyze.cpp.o
816
[ 53%] Building CXX object src/gromacs/CMakeFiles/libgromacs.dir/gmxana/gmx_angle.cpp.o
817
[ 53%] Building CXX object src/gromacs/CMakeFiles/libgromacs.dir/gmxana/gmx_awh.cpp.o
818
[ 53%] Building CXX object src/gromacs/CMakeFiles/libgromacs.dir/gmxana/gmx_bar.cpp.o
819
[ 53%] Building CXX object src/gromacs/CMakeFiles/libgromacs.dir/gmxana/gmx_bundle.cpp.o
820
[ 53%] Building CXX object src/gromacs/CMakeFiles/libgromacs.dir/gmxana/gmx_chi.cpp.o
821
[ 53%] Building CXX object src/gromacs/CMakeFiles/libgromacs.dir/gmxana/gmx_cluster.cpp.o
822
[ 53%] Building CXX object src/gromacs/CMakeFiles/libgromacs.dir/gmxana/gmx_clustsize.cpp.o
823
[ 53%] Building CXX object src/gromacs/CMakeFiles/libgromacs.dir/gmxana/gmx_confrms.cpp.o
824
[ 53%] Building CXX object src/gromacs/CMakeFiles/libgromacs.dir/gmxana/gmx_covar.cpp.o
825
[ 53%] Building CXX object src/gromacs/CMakeFiles/libgromacs.dir/gmxana/gmx_current.cpp.o
826
[ 53%] Building CXX object src/gromacs/CMakeFiles/libgromacs.dir/gmxana/gmx_density.cpp.o
827
[ 54%] Building CXX object src/gromacs/CMakeFiles/libgromacs.dir/gmxana/gmx_densmap.cpp.o
828
[ 54%] Building CXX object src/gromacs/CMakeFiles/libgromacs.dir/gmxana/gmx_densorder.cpp.o
829
[ 54%] Building CXX object src/gromacs/CMakeFiles/libgromacs.dir/gmxana/gmx_dielectric.cpp.o
830
[ 54%] Building CXX object src/gromacs/CMakeFiles/libgromacs.dir/gmxana/gmx_dipoles.cpp.o
831
[ 54%] Building CXX object src/gromacs/CMakeFiles/libgromacs.dir/gmxana/gmx_disre.cpp.o
832
[ 54%] Building CXX object src/gromacs/CMakeFiles/libgromacs.dir/gmxana/gmx_do_dssp.cpp.o
833
[ 54%] Building CXX object src/gromacs/CMakeFiles/libgromacs.dir/gmxana/gmx_dos.cpp.o
834
[ 54%] Building CXX object src/gromacs/CMakeFiles/libgromacs.dir/gmxana/gmx_dyecoupl.cpp.o
835
[ 54%] Building CXX object src/gromacs/CMakeFiles/libgromacs.dir/gmxana/gmx_enemat.cpp.o
836
[ 54%] Building CXX object src/gromacs/CMakeFiles/libgromacs.dir/gmxana/gmx_energy.cpp.o
837
[ 54%] Building CXX object src/gromacs/CMakeFiles/libgromacs.dir/gmxana/gmx_filter.cpp.o
838
[ 54%] Building CXX object src/gromacs/CMakeFiles/libgromacs.dir/gmxana/gmx_gyrate.cpp.o
839
[ 54%] Building CXX object src/gromacs/CMakeFiles/libgromacs.dir/gmxana/gmx_h2order.cpp.o
840
[ 54%] Building CXX object src/gromacs/CMakeFiles/libgromacs.dir/gmxana/gmx_hbond.cpp.o
841
[ 56%] Building CXX object src/gromacs/CMakeFiles/libgromacs.dir/gmxana/gmx_helix.cpp.o
842
[ 56%] Building CXX object src/gromacs/CMakeFiles/libgromacs.dir/gmxana/gmx_helixorient.cpp.o
843
[ 56%] Building CXX object src/gromacs/CMakeFiles/libgromacs.dir/gmxana/gmx_hydorder.cpp.o
844
[ 56%] Building CXX object src/gromacs/CMakeFiles/libgromacs.dir/gmxana/gmx_lie.cpp.o
845
[ 56%] Building CXX object src/gromacs/CMakeFiles/libgromacs.dir/gmxana/gmx_make_edi.cpp.o
846
[ 56%] Building CXX object src/gromacs/CMakeFiles/libgromacs.dir/gmxana/gmx_mdmat.cpp.o
847
[ 56%] Building CXX object src/gromacs/CMakeFiles/libgromacs.dir/gmxana/gmx_mindist.cpp.o
848
[ 56%] Building CXX object src/gromacs/CMakeFiles/libgromacs.dir/gmxana/gmx_msd.cpp.o
849
[ 56%] Building CXX object src/gromacs/CMakeFiles/libgromacs.dir/gmxana/gmx_nmeig.cpp.o
850
[ 56%] Building CXX object src/gromacs/CMakeFiles/libgromacs.dir/gmxana/gmx_nmens.cpp.o
851
[ 56%] Building CXX object src/gromacs/CMakeFiles/libgromacs.dir/gmxana/gmx_nmr.cpp.o
852
[ 56%] Building CXX object src/gromacs/CMakeFiles/libgromacs.dir/gmxana/gmx_nmtraj.cpp.o
853
[ 56%] Building CXX object src/gromacs/CMakeFiles/libgromacs.dir/gmxana/gmx_order.cpp.o
854
[ 56%] Building CXX object src/gromacs/CMakeFiles/libgromacs.dir/gmxana/gmx_polystat.cpp.o
855
[ 56%] Building CXX object src/gromacs/CMakeFiles/libgromacs.dir/gmxana/gmx_potential.cpp.o
856
[ 58%] Building CXX object src/gromacs/CMakeFiles/libgromacs.dir/gmxana/gmx_principal.cpp.o
857
[ 58%] Building CXX object src/gromacs/CMakeFiles/libgromacs.dir/gmxana/gmx_rama.cpp.o
858
[ 58%] Building CXX object src/gromacs/CMakeFiles/libgromacs.dir/gmxana/gmx_rms.cpp.o
859
[ 58%] Building CXX object src/gromacs/CMakeFiles/libgromacs.dir/gmxana/gmx_rmsdist.cpp.o
860
[ 58%] Building CXX object src/gromacs/CMakeFiles/libgromacs.dir/gmxana/gmx_rmsf.cpp.o
861
[ 58%] Building CXX object src/gromacs/CMakeFiles/libgromacs.dir/gmxana/gmx_rotacf.cpp.o
862
[ 58%] Building CXX object src/gromacs/CMakeFiles/libgromacs.dir/gmxana/gmx_rotmat.cpp.o
863
[ 58%] Building CXX object src/gromacs/CMakeFiles/libgromacs.dir/gmxana/gmx_saltbr.cpp.o
864
[ 58%] Building CXX object src/gromacs/CMakeFiles/libgromacs.dir/gmxana/gmx_sans.cpp.o
865
[ 58%] Building CXX object src/gromacs/CMakeFiles/libgromacs.dir/gmxana/gmx_saxs.cpp.o
866
[ 58%] Building CXX object src/gromacs/CMakeFiles/libgromacs.dir/gmxana/gmx_sham.cpp.o
867
[ 58%] Building CXX object src/gromacs/CMakeFiles/libgromacs.dir/gmxana/gmx_sigeps.cpp.o
868
[ 58%] Building CXX object src/gromacs/CMakeFiles/libgromacs.dir/gmxana/gmx_sorient.cpp.o
869
[ 58%] Building CXX object src/gromacs/CMakeFiles/libgromacs.dir/gmxana/gmx_spatial.cpp.o
870
[ 59%] Building CXX object src/gromacs/CMakeFiles/libgromacs.dir/gmxana/gmx_spol.cpp.o
871
[ 59%] Building CXX object src/gromacs/CMakeFiles/libgromacs.dir/gmxana/gmx_tcaf.cpp.o
872
[ 59%] Building CXX object src/gromacs/CMakeFiles/libgromacs.dir/gmxana/gmx_traj.cpp.o
873
[ 59%] Building CXX object src/gromacs/CMakeFiles/libgromacs.dir/gmxana/gmx_trjorder.cpp.o
874
[ 59%] Building CXX object src/gromacs/CMakeFiles/libgromacs.dir/gmxana/gmx_vanhove.cpp.o
875
[ 59%] Building CXX object src/gromacs/CMakeFiles/libgromacs.dir/gmxana/gmx_velacc.cpp.o
876
[ 59%] Building CXX object src/gromacs/CMakeFiles/libgromacs.dir/gmxana/gmx_wham.cpp.o
877
[ 59%] Building CXX object src/gromacs/CMakeFiles/libgromacs.dir/gmxana/gmx_wheel.cpp.o
878
[ 59%] Building CXX object src/gromacs/CMakeFiles/libgromacs.dir/gmxana/gmx_xpm2ps.cpp.o
879
[ 59%] Building CXX object src/gromacs/CMakeFiles/libgromacs.dir/gmxana/hxprops.cpp.o
880
[ 59%] Building CXX object src/gromacs/CMakeFiles/libgromacs.dir/gmxana/nrama.cpp.o
881
[ 59%] Building CXX object src/gromacs/CMakeFiles/libgromacs.dir/gmxana/nsfactor.cpp.o
882
[ 59%] Building CXX object src/gromacs/CMakeFiles/libgromacs.dir/gmxana/powerspect.cpp.o
883
[ 59%] Building CXX object src/gromacs/CMakeFiles/libgromacs.dir/gmxana/pp2shift.cpp.o
884
[ 59%] Building CXX object src/gromacs/CMakeFiles/libgromacs.dir/gmxana/princ.cpp.o
885
[ 61%] Building CXX object src/gromacs/CMakeFiles/libgromacs.dir/gmxana/sfactor.cpp.o
886
[ 61%] Building CXX object src/gromacs/CMakeFiles/libgromacs.dir/gmxana/thermochemistry.cpp.o
887
[ 61%] Building CXX object src/gromacs/CMakeFiles/libgromacs.dir/gmxpreprocess/add_par.cpp.o
888
[ 61%] Building CXX object src/gromacs/CMakeFiles/libgromacs.dir/gmxpreprocess/calch.cpp.o
889
[ 61%] Building CXX object src/gromacs/CMakeFiles/libgromacs.dir/gmxpreprocess/convparm.cpp.o
890
[ 61%] Building CXX object src/gromacs/CMakeFiles/libgromacs.dir/gmxpreprocess/editconf.cpp.o
891
[ 61%] Building CXX object src/gromacs/CMakeFiles/libgromacs.dir/gmxpreprocess/fflibutil.cpp.o
892
[ 61%] Building CXX object src/gromacs/CMakeFiles/libgromacs.dir/gmxpreprocess/gen_ad.cpp.o
893
[ 61%] Building CXX object src/gromacs/CMakeFiles/libgromacs.dir/gmxpreprocess/gen_maxwell_velocities.cpp.o
894
[ 61%] Building CXX object src/gromacs/CMakeFiles/libgromacs.dir/gmxpreprocess/gen_vsite.cpp.o
895
[ 61%] Building CXX object src/gromacs/CMakeFiles/libgromacs.dir/gmxpreprocess/genconf.cpp.o
896
[ 61%] Building CXX object src/gromacs/CMakeFiles/libgromacs.dir/gmxpreprocess/genhydro.cpp.o
897
[ 61%] Building CXX object src/gromacs/CMakeFiles/libgromacs.dir/gmxpreprocess/genion.cpp.o
898
[ 61%] Building CXX object src/gromacs/CMakeFiles/libgromacs.dir/gmxpreprocess/genrestr.cpp.o
899
[ 62%] Building CXX object src/gromacs/CMakeFiles/libgromacs.dir/gmxpreprocess/gmxcpp.cpp.o
900
[ 62%] Building CXX object src/gromacs/CMakeFiles/libgromacs.dir/gmxpreprocess/gpp_atomtype.cpp.o
901
[ 62%] Building CXX object src/gromacs/CMakeFiles/libgromacs.dir/gmxpreprocess/gpp_bond_atomtype.cpp.o
902
[ 62%] Building CXX object src/gromacs/CMakeFiles/libgromacs.dir/gmxpreprocess/gpp_nextnb.cpp.o
903
[ 62%] Building CXX object src/gromacs/CMakeFiles/libgromacs.dir/gmxpreprocess/grompp.cpp.o
904
[ 62%] Building CXX object src/gromacs/CMakeFiles/libgromacs.dir/gmxpreprocess/h_db.cpp.o
905
[ 62%] Building CXX object src/gromacs/CMakeFiles/libgromacs.dir/gmxpreprocess/hackblock.cpp.o
906
[ 62%] Building CXX object src/gromacs/CMakeFiles/libgromacs.dir/gmxpreprocess/hizzie.cpp.o
907
[ 62%] Building CXX object src/gromacs/CMakeFiles/libgromacs.dir/gmxpreprocess/insert_molecules.cpp.o
908
[ 62%] Building CXX object src/gromacs/CMakeFiles/libgromacs.dir/gmxpreprocess/makeexclusiondistances.cpp.o
909
[ 62%] Building CXX object src/gromacs/CMakeFiles/libgromacs.dir/gmxpreprocess/nm2type.cpp.o
910
[ 62%] Building CXX object src/gromacs/CMakeFiles/libgromacs.dir/gmxpreprocess/pdb2gmx.cpp.o
911
[ 62%] Building CXX object src/gromacs/CMakeFiles/libgromacs.dir/gmxpreprocess/pdb2top.cpp.o
912
[ 62%] Building CXX object src/gromacs/CMakeFiles/libgromacs.dir/gmxpreprocess/pgutil.cpp.o
913
[ 64%] Building CXX object src/gromacs/CMakeFiles/libgromacs.dir/gmxpreprocess/readir.cpp.o
914
[ 64%] Building CXX object src/gromacs/CMakeFiles/libgromacs.dir/gmxpreprocess/readpull.cpp.o
915
[ 64%] Building CXX object src/gromacs/CMakeFiles/libgromacs.dir/gmxpreprocess/readrot.cpp.o
916
[ 64%] Building CXX object src/gromacs/CMakeFiles/libgromacs.dir/gmxpreprocess/resall.cpp.o
917
[ 64%] Building CXX object src/gromacs/CMakeFiles/libgromacs.dir/gmxpreprocess/solvate.cpp.o
918
[ 64%] Building CXX object src/gromacs/CMakeFiles/libgromacs.dir/gmxpreprocess/specbond.cpp.o
919
[ 64%] Building CXX object src/gromacs/CMakeFiles/libgromacs.dir/gmxpreprocess/ter_db.cpp.o
920
[ 64%] Building CXX object src/gromacs/CMakeFiles/libgromacs.dir/gmxpreprocess/tomorse.cpp.o
921
[ 64%] Building CXX object src/gromacs/CMakeFiles/libgromacs.dir/gmxpreprocess/topdirs.cpp.o
922
[ 64%] Building CXX object src/gromacs/CMakeFiles/libgromacs.dir/gmxpreprocess/topio.cpp.o
923
[ 64%] Building CXX object src/gromacs/CMakeFiles/libgromacs.dir/gmxpreprocess/toppush.cpp.o
924
[ 64%] Building CXX object src/gromacs/CMakeFiles/libgromacs.dir/gmxpreprocess/topshake.cpp.o
925
[ 64%] Building CXX object src/gromacs/CMakeFiles/libgromacs.dir/gmxpreprocess/toputil.cpp.o
926
[ 64%] Building CXX object src/gromacs/CMakeFiles/libgromacs.dir/gmxpreprocess/vsite_parm.cpp.o
927
[ 64%] Building CXX object src/gromacs/CMakeFiles/libgromacs.dir/gmxpreprocess/x2top.cpp.o
928
[ 66%] Building CXX object src/gromacs/CMakeFiles/libgromacs.dir/gmxpreprocess/xlate.cpp.o
929
[ 66%] Building CXX object src/gromacs/CMakeFiles/libgromacs.dir/correlationfunctions/autocorr.cpp.o
930
[ 66%] Building CXX object src/gromacs/CMakeFiles/libgromacs.dir/correlationfunctions/crosscorr.cpp.o
931
[ 66%] Building CXX object src/gromacs/CMakeFiles/libgromacs.dir/correlationfunctions/expfit.cpp.o
932
[ 66%] Building CXX object src/gromacs/CMakeFiles/libgromacs.dir/correlationfunctions/gmx_lmcurve.cpp.o
933
[ 66%] Building CXX object src/gromacs/CMakeFiles/libgromacs.dir/correlationfunctions/integrate.cpp.o
934
[ 66%] Building CXX object src/gromacs/CMakeFiles/libgromacs.dir/correlationfunctions/manyautocorrelation.cpp.o
935
[ 66%] Building CXX object src/gromacs/CMakeFiles/libgromacs.dir/correlationfunctions/polynomials.cpp.o
936
[ 66%] Building CXX object src/gromacs/CMakeFiles/libgromacs.dir/statistics/statistics.cpp.o
937
[ 66%] Building CXX object src/gromacs/CMakeFiles/libgromacs.dir/analysisdata/abstractdata.cpp.o
938
[ 66%] Building CXX object src/gromacs/CMakeFiles/libgromacs.dir/analysisdata/analysisdata.cpp.o
939
[ 66%] Building CXX object src/gromacs/CMakeFiles/libgromacs.dir/analysisdata/arraydata.cpp.o
940
[ 66%] Building CXX object src/gromacs/CMakeFiles/libgromacs.dir/analysisdata/dataframe.cpp.o
941
[ 66%] Building CXX object src/gromacs/CMakeFiles/libgromacs.dir/analysisdata/datamodule.cpp.o
942
[ 67%] Building CXX object src/gromacs/CMakeFiles/libgromacs.dir/analysisdata/datamodulemanager.cpp.o
943
[ 67%] Building CXX object src/gromacs/CMakeFiles/libgromacs.dir/analysisdata/dataproxy.cpp.o
944
[ 67%] Building CXX object src/gromacs/CMakeFiles/libgromacs.dir/analysisdata/datastorage.cpp.o
945
[ 67%] Building CXX object src/gromacs/CMakeFiles/libgromacs.dir/analysisdata/modules/average.cpp.o
946
[ 67%] Building CXX object src/gromacs/CMakeFiles/libgromacs.dir/analysisdata/modules/displacement.cpp.o
947
[ 67%] Building CXX object src/gromacs/CMakeFiles/libgromacs.dir/analysisdata/modules/frameaverager.cpp.o
948
[ 67%] Building CXX object src/gromacs/CMakeFiles/libgromacs.dir/analysisdata/modules/histogram.cpp.o
949
[ 67%] Building CXX object src/gromacs/CMakeFiles/libgromacs.dir/analysisdata/modules/lifetime.cpp.o
950
[ 67%] Building CXX object src/gromacs/CMakeFiles/libgromacs.dir/analysisdata/modules/plot.cpp.o
951
[ 67%] Building CXX object src/gromacs/CMakeFiles/libgromacs.dir/coordinateio/coordinatefile.cpp.o
952
[ 67%] Building CXX object src/gromacs/CMakeFiles/libgromacs.dir/coordinateio/outputadaptercontainer.cpp.o
953
[ 67%] Building CXX object src/gromacs/CMakeFiles/libgromacs.dir/coordinateio/outputadapters/outputselector.cpp.o
954
[ 67%] Building CXX object src/gromacs/CMakeFiles/libgromacs.dir/coordinateio/outputadapters/setatoms.cpp.o
955
[ 67%] Building CXX object src/gromacs/CMakeFiles/libgromacs.dir/coordinateio/outputadapters/setforces.cpp.o
956
[ 67%] Building CXX object src/gromacs/CMakeFiles/libgromacs.dir/coordinateio/outputadapters/setprecision.cpp.o
957
[ 69%] Building CXX object src/gromacs/CMakeFiles/libgromacs.dir/coordinateio/outputadapters/setstarttime.cpp.o
958
[ 69%] Building CXX object src/gromacs/CMakeFiles/libgromacs.dir/coordinateio/outputadapters/settimestep.cpp.o
959
[ 69%] Building CXX object src/gromacs/CMakeFiles/libgromacs.dir/coordinateio/outputadapters/setvelocities.cpp.o
960
[ 69%] Building CXX object src/gromacs/CMakeFiles/libgromacs.dir/coordinateio/requirements.cpp.o
961
[ 69%] Building CXX object src/gromacs/CMakeFiles/libgromacs.dir/trajectoryanalysis/analysismodule.cpp.o
962
[ 69%] Building CXX object src/gromacs/CMakeFiles/libgromacs.dir/trajectoryanalysis/analysissettings.cpp.o
963
[ 69%] Building CXX object src/gromacs/CMakeFiles/libgromacs.dir/trajectoryanalysis/cmdlinerunner.cpp.o
964
[ 69%] Building CXX object src/gromacs/CMakeFiles/libgromacs.dir/trajectoryanalysis/modules.cpp.o
965
[ 69%] Building CXX object src/gromacs/CMakeFiles/libgromacs.dir/trajectoryanalysis/modules/angle.cpp.o
966
[ 69%] Building CXX object src/gromacs/CMakeFiles/libgromacs.dir/trajectoryanalysis/modules/convert_trj.cpp.o
967
[ 69%] Building CXX object src/gromacs/CMakeFiles/libgromacs.dir/trajectoryanalysis/modules/distance.cpp.o
968
[ 69%] Building CXX object src/gromacs/CMakeFiles/libgromacs.dir/trajectoryanalysis/modules/extract_cluster.cpp.o
969
[ 69%] Building CXX object src/gromacs/CMakeFiles/libgromacs.dir/trajectoryanalysis/modules/freevolume.cpp.o
970
[ 69%] Building CXX object src/gromacs/CMakeFiles/libgromacs.dir/trajectoryanalysis/modules/pairdist.cpp.o
971
[ 70%] Building CXX object src/gromacs/CMakeFiles/libgromacs.dir/trajectoryanalysis/modules/rdf.cpp.o
972
[ 70%] Building CXX object src/gromacs/CMakeFiles/libgromacs.dir/trajectoryanalysis/modules/sasa.cpp.o
973
[ 70%] Building CXX object src/gromacs/CMakeFiles/libgromacs.dir/trajectoryanalysis/modules/select.cpp.o
974
[ 70%] Building CXX object src/gromacs/CMakeFiles/libgromacs.dir/trajectoryanalysis/modules/surfacearea.cpp.o
975
[ 70%] Building CXX object src/gromacs/CMakeFiles/libgromacs.dir/trajectoryanalysis/modules/trajectory.cpp.o
976
[ 70%] Building CXX object src/gromacs/CMakeFiles/libgromacs.dir/trajectoryanalysis/runnercommon.cpp.o
977
[ 70%] Building CXX object src/gromacs/CMakeFiles/libgromacs.dir/trajectoryanalysis/topologyinformation.cpp.o
978
[ 70%] Building CXX object src/gromacs/CMakeFiles/libgromacs.dir/tools/check.cpp.o
979
[ 70%] Building CXX object src/gromacs/CMakeFiles/libgromacs.dir/tools/convert_tpr.cpp.o
980
[ 70%] Building CXX object src/gromacs/CMakeFiles/libgromacs.dir/tools/dump.cpp.o
981
[ 70%] Building CXX object src/gromacs/CMakeFiles/libgromacs.dir/tools/eneconv.cpp.o
982
[ 70%] Building CXX object src/gromacs/CMakeFiles/libgromacs.dir/tools/make_ndx.cpp.o
983
[ 70%] Building CXX object src/gromacs/CMakeFiles/libgromacs.dir/tools/mk_angndx.cpp.o
984
[ 70%] Building CXX object src/gromacs/CMakeFiles/libgromacs.dir/tools/pme_error.cpp.o
985
[ 72%] Building CXX object src/gromacs/CMakeFiles/libgromacs.dir/tools/report_methods.cpp.o
986
[ 72%] Building CXX object src/gromacs/CMakeFiles/libgromacs.dir/tools/trjcat.cpp.o
987
[ 72%] Building CXX object src/gromacs/CMakeFiles/libgromacs.dir/tools/trjconv.cpp.o
988
[ 72%] Building CXX object src/gromacs/CMakeFiles/libgromacs.dir/tools/tune_pme.cpp.o
989
[ 72%] Building CXX object src/gromacs/CMakeFiles/libgromacs.dir/gmxlib/conformation_utilities.cpp.o
990
[ 72%] Building CXX object src/gromacs/CMakeFiles/libgromacs.dir/gmxlib/network.cpp.o
991
[ 72%] Building CXX object src/gromacs/CMakeFiles/libgromacs.dir/gmxlib/nrnb.cpp.o
992
[ 72%] Building CXX object src/gromacs/CMakeFiles/libgromacs.dir/gmxlib/nonbonded/nb_free_energy.cpp.o
993
[ 72%] Building CXX object src/gromacs/CMakeFiles/libgromacs.dir/mdlib/boxdeformation.cpp.o
994
[ 72%] Building CXX object src/gromacs/CMakeFiles/libgromacs.dir/mdlib/broadcaststructs.cpp.o
995
[ 72%] Building CXX object src/gromacs/CMakeFiles/libgromacs.dir/mdlib/calc_verletbuf.cpp.o
996
[ 72%] Building CXX object src/gromacs/CMakeFiles/libgromacs.dir/mdlib/calcmu.cpp.o
997
[ 72%] Building CXX object src/gromacs/CMakeFiles/libgromacs.dir/mdlib/calcvir.cpp.o
998
[ 72%] Building CXX object src/gromacs/CMakeFiles/libgromacs.dir/mdlib/checkpointhandler.cpp.o
999
[ 72%] Building CXX object src/gromacs/CMakeFiles/libgromacs.dir/mdlib/compute_io.cpp.o
1000
[ 74%] Building CXX object src/gromacs/CMakeFiles/libgromacs.dir/mdlib/constr.cpp.o
1001
[ 74%] Building CXX object src/gromacs/CMakeFiles/libgromacs.dir/mdlib/constraintrange.cpp.o
1002
[ 74%] Building CXX object src/gromacs/CMakeFiles/libgromacs.dir/mdlib/coupling.cpp.o
1003
[ 74%] Building CXX object src/gromacs/CMakeFiles/libgromacs.dir/mdlib/dispersioncorrection.cpp.o
1004
[ 74%] Building CXX object src/gromacs/CMakeFiles/libgromacs.dir/mdlib/ebin.cpp.o
1005
[ 74%] Building CXX object src/gromacs/CMakeFiles/libgromacs.dir/mdlib/enerdata_utils.cpp.o
1006
[ 74%] Building CXX object src/gromacs/CMakeFiles/libgromacs.dir/mdlib/energyoutput.cpp.o
1007
[ 74%] Building CXX object src/gromacs/CMakeFiles/libgromacs.dir/mdlib/expanded.cpp.o
1008
[ 74%] Building CXX object src/gromacs/CMakeFiles/libgromacs.dir/mdlib/force.cpp.o
1009
[ 74%] Building CXX object src/gromacs/CMakeFiles/libgromacs.dir/mdlib/forcerec.cpp.o
1010
[ 74%] Building CXX object src/gromacs/CMakeFiles/libgromacs.dir/mdlib/gmx_omp_nthreads.cpp.o
1011
[ 74%] Building CXX object src/gromacs/CMakeFiles/libgromacs.dir/mdlib/groupcoord.cpp.o
1012
[ 74%] Building CXX object src/gromacs/CMakeFiles/libgromacs.dir/mdlib/lincs.cpp.o
1013
[ 74%] Building CXX object src/gromacs/CMakeFiles/libgromacs.dir/mdlib/md_support.cpp.o
1014
[ 75%] Building CXX object src/gromacs/CMakeFiles/libgromacs.dir/mdlib/mdatoms.cpp.o
1015
[ 75%] Building CXX object src/gromacs/CMakeFiles/libgromacs.dir/mdlib/mdebin_bar.cpp.o
1016
[ 75%] Building CXX object src/gromacs/CMakeFiles/libgromacs.dir/mdlib/mdoutf.cpp.o
1017
[ 75%] Building CXX object src/gromacs/CMakeFiles/libgromacs.dir/mdlib/membed.cpp.o
1018
[ 75%] Building CXX object src/gromacs/CMakeFiles/libgromacs.dir/mdlib/nsgrid.cpp.o
1019
[ 75%] Building CXX object src/gromacs/CMakeFiles/libgromacs.dir/mdlib/perf_est.cpp.o
1020
[ 75%] Building CXX object src/gromacs/CMakeFiles/libgromacs.dir/mdlib/qm_gamess.cpp.o
1021
[ 75%] Building CXX object src/gromacs/CMakeFiles/libgromacs.dir/mdlib/qm_gaussian.cpp.o
1022
[ 75%] Building CXX object src/gromacs/CMakeFiles/libgromacs.dir/mdlib/qm_mopac.cpp.o
1023
[ 75%] Building CXX object src/gromacs/CMakeFiles/libgromacs.dir/mdlib/qm_orca.cpp.o
1024
[ 75%] Building CXX object src/gromacs/CMakeFiles/libgromacs.dir/mdlib/qmmm.cpp.o
1025
[ 75%] Building CXX object src/gromacs/CMakeFiles/libgromacs.dir/mdlib/rbin.cpp.o
1026
[ 75%] Building CXX object src/gromacs/CMakeFiles/libgromacs.dir/mdlib/resethandler.cpp.o
1027
[ 75%] Building CXX object src/gromacs/CMakeFiles/libgromacs.dir/mdlib/rf_util.cpp.o
1028
[ 75%] Building CXX object src/gromacs/CMakeFiles/libgromacs.dir/mdlib/settle.cpp.o
1029
[ 77%] Building CXX object src/gromacs/CMakeFiles/libgromacs.dir/mdlib/shake.cpp.o
1030
[ 77%] Building CXX object src/gromacs/CMakeFiles/libgromacs.dir/mdlib/sighandler.cpp.o
1031
[ 77%] Building CXX object src/gromacs/CMakeFiles/libgromacs.dir/mdlib/sim_util.cpp.o
1032
[ 77%] Building CXX object src/gromacs/CMakeFiles/libgromacs.dir/mdlib/simulationsignal.cpp.o
1033
[ 77%] Building CXX object src/gromacs/CMakeFiles/libgromacs.dir/mdlib/splitter.cpp.o
1034
[ 77%] Building CXX object src/gromacs/CMakeFiles/libgromacs.dir/mdlib/stat.cpp.o
1035
[ 77%] Building CXX object src/gromacs/CMakeFiles/libgromacs.dir/mdlib/stophandler.cpp.o
1036
[ 77%] Building CXX object src/gromacs/CMakeFiles/libgromacs.dir/mdlib/tgroup.cpp.o
1037
[ 77%] Building CXX object src/gromacs/CMakeFiles/libgromacs.dir/mdlib/trajectory_writing.cpp.o
1038
[ 77%] Building CXX object src/gromacs/CMakeFiles/libgromacs.dir/mdlib/update.cpp.o
1039
[ 77%] Building CXX object src/gromacs/CMakeFiles/libgromacs.dir/mdlib/update_constrain_cuda_impl.cpp.o
1040
[ 77%] Building CXX object src/gromacs/CMakeFiles/libgromacs.dir/mdlib/updategroups.cpp.o
1041
[ 77%] Building CXX object src/gromacs/CMakeFiles/libgromacs.dir/mdlib/updategroupscog.cpp.o
1042
[ 77%] Building CXX object src/gromacs/CMakeFiles/libgromacs.dir/mdlib/vcm.cpp.o
1043
[ 79%] Building CXX object src/gromacs/CMakeFiles/libgromacs.dir/mdlib/vsite.cpp.o
1044
[ 79%] Building CXX object src/gromacs/CMakeFiles/libgromacs.dir/mdlib/wall.cpp.o
1045
[ 79%] Building CXX object src/gromacs/CMakeFiles/libgromacs.dir/applied_forces/densityfitting.cpp.o
1046
[ 79%] Building CXX object src/gromacs/CMakeFiles/libgromacs.dir/applied_forces/densityfittingamplitudelookup.cpp.o
1047
[ 79%] Building CXX object src/gromacs/CMakeFiles/libgromacs.dir/applied_forces/densityfittingforceprovider.cpp.o
1048
[ 79%] Building CXX object src/gromacs/CMakeFiles/libgromacs.dir/applied_forces/densityfittingoptions.cpp.o
1049
[ 79%] Building CXX object src/gromacs/CMakeFiles/libgromacs.dir/applied_forces/densityfittingoutputprovider.cpp.o
1050
[ 79%] Building CXX object src/gromacs/CMakeFiles/libgromacs.dir/applied_forces/densityfittingparameters.cpp.o
1051
[ 79%] Building CXX object src/gromacs/CMakeFiles/libgromacs.dir/applied_forces/electricfield.cpp.o
1052
[ 79%] Building CXX object src/gromacs/CMakeFiles/libgromacs.dir/listed_forces/bonded.cpp.o
1053
[ 79%] Building CXX object src/gromacs/CMakeFiles/libgromacs.dir/listed_forces/disre.cpp.o
1054
[ 79%] Building CXX object src/gromacs/CMakeFiles/libgromacs.dir/listed_forces/gpubonded_impl.cpp.o
1055
[ 79%] Building CXX object src/gromacs/CMakeFiles/libgromacs.dir/listed_forces/listed_forces.cpp.o
1056
[ 79%] Building CXX object src/gromacs/CMakeFiles/libgromacs.dir/listed_forces/listed_internal.cpp.o
1057
[ 79%] Building CXX object src/gromacs/CMakeFiles/libgromacs.dir/listed_forces/manage_threading.cpp.o
1058
[ 80%] Building CXX object src/gromacs/CMakeFiles/libgromacs.dir/listed_forces/orires.cpp.o
1059
[ 80%] Building CXX object src/gromacs/CMakeFiles/libgromacs.dir/listed_forces/pairs.cpp.o
1060
[ 80%] Building CXX object src/gromacs/CMakeFiles/libgromacs.dir/listed_forces/position_restraints.cpp.o
1061
[ 80%] Building CXX object src/gromacs/CMakeFiles/libgromacs.dir/listed_forces/restcbt.cpp.o
1062
[ 80%] Building CXX object src/gromacs/CMakeFiles/libgromacs.dir/ewald/calculate_spline_moduli.cpp.o
1063
[ 80%] Building CXX object src/gromacs/CMakeFiles/libgromacs.dir/ewald/ewald.cpp.o
1064
[ 80%] Building CXX object src/gromacs/CMakeFiles/libgromacs.dir/ewald/ewald_utils.cpp.o
1065
[ 80%] Building CXX object src/gromacs/CMakeFiles/libgromacs.dir/ewald/long_range_correction.cpp.o
1066
[ 80%] Building CXX object src/gromacs/CMakeFiles/libgromacs.dir/ewald/pme.cpp.o
1067
[ 80%] Building CXX object src/gromacs/CMakeFiles/libgromacs.dir/ewald/pme_gather.cpp.o
1068
[ 80%] Building CXX object src/gromacs/CMakeFiles/libgromacs.dir/ewald/pme_grid.cpp.o
1069
[ 80%] Building CXX object src/gromacs/CMakeFiles/libgromacs.dir/ewald/pme_load_balancing.cpp.o
1070
[ 80%] Building CXX object src/gromacs/CMakeFiles/libgromacs.dir/ewald/pme_only.cpp.o
1071
[ 80%] Building CXX object src/gromacs/CMakeFiles/libgromacs.dir/ewald/pme_pp.cpp.o
1072
[ 82%] Building CXX object src/gromacs/CMakeFiles/libgromacs.dir/ewald/pme_redistribute.cpp.o
1073
[ 82%] Building CXX object src/gromacs/CMakeFiles/libgromacs.dir/ewald/pme_solve.cpp.o
1074
[ 82%] Building CXX object src/gromacs/CMakeFiles/libgromacs.dir/ewald/pme_spline_work.cpp.o
1075
[ 82%] Building CXX object src/gromacs/CMakeFiles/libgromacs.dir/ewald/pme_spread.cpp.o
1076
[ 82%] Building CXX object src/gromacs/CMakeFiles/libgromacs.dir/ewald/pme_gpu_program.cpp.o
1077
[ 82%] Building CXX object src/gromacs/CMakeFiles/libgromacs.dir/ewald/pme_pp_comm_gpu_impl.cpp.o
1078
[ 82%] Building CXX object src/gromacs/CMakeFiles/libgromacs.dir/ewald/pme_coordinate_receiver_gpu_impl.cpp.o
1079
[ 82%] Building CXX object src/gromacs/CMakeFiles/libgromacs.dir/ewald/pme_force_sender_gpu_impl.cpp.o
1080
[ 82%] Building CXX object src/gromacs/CMakeFiles/libgromacs.dir/ewald/pme_gpu_3dfft_ocl.cpp.o
1081
[ 82%] Building CXX object src/gromacs/CMakeFiles/libgromacs.dir/ewald/pme_gpu_program_impl_ocl.cpp.o
1082
[ 82%] Building CXX object src/gromacs/CMakeFiles/libgromacs.dir/ewald/pme_gpu.cpp.o
1083
[ 82%] Building CXX object src/gromacs/CMakeFiles/libgromacs.dir/ewald/pme_gpu_internal.cpp.o
1084
[ 82%] Building CXX object src/gromacs/CMakeFiles/libgromacs.dir/ewald/pme_gpu_timings.cpp.o
1085
[ 82%] Building CXX object src/gromacs/CMakeFiles/libgromacs.dir/fft/calcgrid.cpp.o
1086
[ 83%] Building CXX object src/gromacs/CMakeFiles/libgromacs.dir/fft/fft.cpp.o
1087
[ 83%] Building CXX object src/gromacs/CMakeFiles/libgromacs.dir/fft/fft5d.cpp.o
1088
[ 83%] Building CXX object src/gromacs/CMakeFiles/libgromacs.dir/fft/parallel_3dfft.cpp.o
1089
[ 83%] Building CXX object src/gromacs/CMakeFiles/libgromacs.dir/fft/fft_fftw3.cpp.o
1090
[ 83%] Building CXX object src/gromacs/CMakeFiles/libgromacs.dir/gpu_utils/clfftinitializer.cpp.o
1091
[ 83%] Building CXX object src/gromacs/CMakeFiles/libgromacs.dir/gpu_utils/hostallocator.cpp.o
1092
[ 83%] Building CXX object src/gromacs/CMakeFiles/libgromacs.dir/gpu_utils/gpu_utils.cpp.o
1093
[ 83%] Building CXX object src/gromacs/CMakeFiles/libgromacs.dir/gpu_utils/gpu_testutils.cpp.o
1094
[ 83%] Building CXX object src/gromacs/CMakeFiles/libgromacs.dir/gpu_utils/gpu_utils_ocl.cpp.o
1095
[ 83%] Building CXX object src/gromacs/CMakeFiles/libgromacs.dir/gpu_utils/ocl_compiler.cpp.o
1096
[ 83%] Building CXX object src/gromacs/CMakeFiles/libgromacs.dir/gpu_utils/ocl_caching.cpp.o
1097
[ 83%] Building CXX object src/gromacs/CMakeFiles/libgromacs.dir/gpu_utils/oclutils.cpp.o
1098
[ 83%] Building CXX object src/gromacs/CMakeFiles/libgromacs.dir/hardware/cpuinfo.cpp.o
1099
[ 83%] Building CXX object src/gromacs/CMakeFiles/libgromacs.dir/hardware/detecthardware.cpp.o
1100
[ 83%] Building CXX object src/gromacs/CMakeFiles/libgromacs.dir/hardware/gpu_hw_info.cpp.o
1101
[ 85%] Building CXX object src/gromacs/CMakeFiles/libgromacs.dir/hardware/hardwaretopology.cpp.o
1102
[ 85%] Building CXX object src/gromacs/CMakeFiles/libgromacs.dir/hardware/printhardware.cpp.o
1103
[ 85%] Building CXX object src/gromacs/CMakeFiles/libgromacs.dir/hardware/identifyavx512fmaunits.cpp.o
1104
[ 85%] Building CXX object src/gromacs/CMakeFiles/libgromacs.dir/mdrun/legacymdrunoptions.cpp.o
1105
[ 85%] Building CXX object src/gromacs/CMakeFiles/libgromacs.dir/mdrun/legacysimulator.cpp.o
1106
[ 85%] Building CXX object src/gromacs/CMakeFiles/libgromacs.dir/mdrun/md.cpp.o
1107
[ 85%] Building CXX object src/gromacs/CMakeFiles/libgromacs.dir/mdrun/mdmodules.cpp.o
1108
[ 85%] Building CXX object src/gromacs/CMakeFiles/libgromacs.dir/mdrun/mimic.cpp.o
1109
[ 85%] Building CXX object src/gromacs/CMakeFiles/libgromacs.dir/mdrun/minimize.cpp.o
1110
[ 85%] Building CXX object src/gromacs/CMakeFiles/libgromacs.dir/mdrun/replicaexchange.cpp.o
1111
[ 85%] Building CXX object src/gromacs/CMakeFiles/libgromacs.dir/mdrun/rerun.cpp.o
1112
[ 85%] Building CXX object src/gromacs/CMakeFiles/libgromacs.dir/mdrun/runner.cpp.o
1113
[ 85%] Building CXX object src/gromacs/CMakeFiles/libgromacs.dir/mdrun/shellfc.cpp.o
1114
[ 85%] Building CXX object src/gromacs/CMakeFiles/libgromacs.dir/mdrun/simulationcontext.cpp.o
1115
[ 87%] Building CXX object src/gromacs/CMakeFiles/libgromacs.dir/mdrun/tpi.cpp.o
1116
[ 87%] Building CXX object src/gromacs/CMakeFiles/libgromacs.dir/mdrunutility/handlerestart.cpp.o
1117
[ 87%] Building CXX object src/gromacs/CMakeFiles/libgromacs.dir/mdrunutility/logging.cpp.o
1118
[ 87%] Building CXX object src/gromacs/CMakeFiles/libgromacs.dir/mdrunutility/multisim.cpp.o
1119
[ 87%] Building CXX object src/gromacs/CMakeFiles/libgromacs.dir/mdrunutility/printtime.cpp.o
1120
[ 87%] Building CXX object src/gromacs/CMakeFiles/libgromacs.dir/mdrunutility/threadaffinity.cpp.o
1121
[ 87%] Building CXX object src/gromacs/CMakeFiles/libgromacs.dir/mdtypes/state_propagator_data_gpu_impl_gpu.cpp.o
1122
[ 87%] Building CXX object src/gromacs/CMakeFiles/libgromacs.dir/options/abstractoption.cpp.o
1123
[ 87%] Building CXX object src/gromacs/CMakeFiles/libgromacs.dir/options/abstractsection.cpp.o
1124
[ 87%] Building CXX object src/gromacs/CMakeFiles/libgromacs.dir/options/basicoptions.cpp.o
1125
[ 87%] Building CXX object src/gromacs/CMakeFiles/libgromacs.dir/options/behaviorcollection.cpp.o
1126
[ 87%] Building CXX object src/gromacs/CMakeFiles/libgromacs.dir/options/filenameoption.cpp.o
1127
[ 87%] Building CXX object src/gromacs/CMakeFiles/libgromacs.dir/options/filenameoptionmanager.cpp.o
1128
[ 87%] Building CXX object src/gromacs/CMakeFiles/libgromacs.dir/options/options.cpp.o
1129
[ 87%] Building CXX object src/gromacs/CMakeFiles/libgromacs.dir/options/optionsassigner.cpp.o
1130
[ 88%] Building CXX object src/gromacs/CMakeFiles/libgromacs.dir/options/optionsection.cpp.o
1131
[ 88%] Building CXX object src/gromacs/CMakeFiles/libgromacs.dir/options/optionsvisitor.cpp.o
1132
[ 88%] Building CXX object src/gromacs/CMakeFiles/libgromacs.dir/options/timeunitmanager.cpp.o
1133
[ 88%] Building CXX object src/gromacs/CMakeFiles/libgromacs.dir/options/treesupport.cpp.o
1134
[ 88%] Building CXX object src/gromacs/CMakeFiles/libgromacs.dir/restraint/manager.cpp.o
1135
[ 88%] Building CXX object src/gromacs/CMakeFiles/libgromacs.dir/restraint/restraintmdmodule.cpp.o
1136
[ 88%] Building CXX object src/gromacs/CMakeFiles/libgromacs.dir/taskassignment/decidegpuusage.cpp.o
1137
[ 88%] Building CXX object src/gromacs/CMakeFiles/libgromacs.dir/taskassignment/decidesimulationworkload.cpp.o
1138
[ 88%] Building CXX object src/gromacs/CMakeFiles/libgromacs.dir/taskassignment/findallgputasks.cpp.o
1139
[ 88%] Building CXX object src/gromacs/CMakeFiles/libgromacs.dir/taskassignment/reportgpuusage.cpp.o
1140
[ 88%] Building CXX object src/gromacs/CMakeFiles/libgromacs.dir/taskassignment/resourcedivision.cpp.o
1141
[ 88%] Building CXX object src/gromacs/CMakeFiles/libgromacs.dir/taskassignment/taskassignment.cpp.o
1142
[ 88%] Building CXX object src/gromacs/CMakeFiles/libgromacs.dir/taskassignment/usergpuids.cpp.o
1143
[ 88%] Building CXX object src/gromacs/CMakeFiles/libgromacs.dir/trajectory/energyframe.cpp.o
1144
[ 90%] Building CXX object src/gromacs/CMakeFiles/libgromacs.dir/trajectory/trajectoryframe.cpp.o
1145
[ 90%] Building CXX object src/gromacs/CMakeFiles/libgromacs.dir/mimic/communicator.cpp.o
1146
[ 90%] Building CXX object src/gromacs/CMakeFiles/libgromacs.dir/mimic/utilities.cpp.o
1147
[ 90%] Building CXX object src/gromacs/CMakeFiles/libgromacs.dir/utility/baseversion-gen.cpp.o
1148
[ 90%] Building CXX object src/gromacs/CMakeFiles/libgromacs.dir/fileio/checkpoint.cpp.o
1149
[ 90%] Building CXX object src/gromacs/CMakeFiles/libgromacs.dir/fileio/confio.cpp.o
1150
[ 90%] Building CXX object src/gromacs/CMakeFiles/libgromacs.dir/fileio/enxio.cpp.o
1151
[ 90%] Building CXX object src/gromacs/CMakeFiles/libgromacs.dir/fileio/espio.cpp.o
1152
[ 90%] Building CXX object src/gromacs/CMakeFiles/libgromacs.dir/fileio/filetypes.cpp.o
1153
[ 90%] Building CXX object src/gromacs/CMakeFiles/libgromacs.dir/fileio/g96io.cpp.o
1154
[ 90%] Building CXX object src/gromacs/CMakeFiles/libgromacs.dir/fileio/gmx_internal_xdr.cpp.o
1155
[ 90%] Building CXX object src/gromacs/CMakeFiles/libgromacs.dir/fileio/gmxfio.cpp.o
1156
[ 90%] Building CXX object src/gromacs/CMakeFiles/libgromacs.dir/fileio/gmxfio_xdr.cpp.o
1157
[ 90%] Building CXX object src/gromacs/CMakeFiles/libgromacs.dir/fileio/groio.cpp.o
1158
[ 90%] Building CXX object src/gromacs/CMakeFiles/libgromacs.dir/fileio/libxdrf.cpp.o
1159
[ 91%] Building CXX object src/gromacs/CMakeFiles/libgromacs.dir/fileio/matio.cpp.o
1160
[ 91%] Building CXX object src/gromacs/CMakeFiles/libgromacs.dir/fileio/md5.cpp.o
1161
[ 91%] Building CXX object src/gromacs/CMakeFiles/libgromacs.dir/fileio/mrcdensitymap.cpp.o
1162
[ 91%] Building CXX object src/gromacs/CMakeFiles/libgromacs.dir/fileio/mrcdensitymapheader.cpp.o
1163
[ 91%] Building CXX object src/gromacs/CMakeFiles/libgromacs.dir/fileio/mrcserializer.cpp.o
1164
[ 91%] Building CXX object src/gromacs/CMakeFiles/libgromacs.dir/fileio/mtxio.cpp.o
1165
[ 91%] Building CXX object src/gromacs/CMakeFiles/libgromacs.dir/fileio/oenv.cpp.o
1166
[ 91%] Building CXX object src/gromacs/CMakeFiles/libgromacs.dir/fileio/pdbio.cpp.o
1167
[ 91%] Building CXX object src/gromacs/CMakeFiles/libgromacs.dir/fileio/readinp.cpp.o
1168
[ 91%] Building CXX object src/gromacs/CMakeFiles/libgromacs.dir/fileio/timecontrol.cpp.o
1169
[ 91%] Building CXX object src/gromacs/CMakeFiles/libgromacs.dir/fileio/tngio.cpp.o
1170
[ 91%] Building CXX object src/gromacs/CMakeFiles/libgromacs.dir/fileio/tpxio.cpp.o
1171
[ 91%] Building CXX object src/gromacs/CMakeFiles/libgromacs.dir/fileio/trrio.cpp.o
1172
[ 91%] Building CXX object src/gromacs/CMakeFiles/libgromacs.dir/fileio/trxio.cpp.o
1173
[ 93%] Building CXX object src/gromacs/CMakeFiles/libgromacs.dir/fileio/vmdio.cpp.o
1174
[ 93%] Building CXX object src/gromacs/CMakeFiles/libgromacs.dir/fileio/warninp.cpp.o
1175
[ 93%] Building CXX object src/gromacs/CMakeFiles/libgromacs.dir/fileio/writeps.cpp.o
1176
[ 93%] Building CXX object src/gromacs/CMakeFiles/libgromacs.dir/fileio/xdrd.cpp.o
1177
[ 93%] Building CXX object src/gromacs/CMakeFiles/libgromacs.dir/fileio/xtcio.cpp.o
1178
[ 93%] Building CXX object src/gromacs/CMakeFiles/libgromacs.dir/fileio/xvgr.cpp.o
1179
[ 93%] Building CXX object src/gromacs/CMakeFiles/libgromacs.dir/selection/centerofmass.cpp.o
1180
[ 93%] Building CXX object src/gromacs/CMakeFiles/libgromacs.dir/selection/compiler.cpp.o
1181
[ 93%] Building CXX object src/gromacs/CMakeFiles/libgromacs.dir/selection/evaluate.cpp.o
1182
[ 93%] Building CXX object src/gromacs/CMakeFiles/libgromacs.dir/selection/indexutil.cpp.o
1183
[ 93%] Building CXX object src/gromacs/CMakeFiles/libgromacs.dir/selection/mempool.cpp.o
1184
[ 93%] Building CXX object src/gromacs/CMakeFiles/libgromacs.dir/selection/nbsearch.cpp.o
1185
[ 93%] Building CXX object src/gromacs/CMakeFiles/libgromacs.dir/selection/params.cpp.o
1186
[ 93%] Building CXX object src/gromacs/CMakeFiles/libgromacs.dir/selection/parsetree.cpp.o
1187
[ 95%] Building CXX object src/gromacs/CMakeFiles/libgromacs.dir/selection/poscalc.cpp.o
1188
[ 95%] Building CXX object src/gromacs/CMakeFiles/libgromacs.dir/selection/position.cpp.o
1189
[ 95%] Building CXX object src/gromacs/CMakeFiles/libgromacs.dir/selection/scanner_internal.cpp.o
1190
[ 95%] Building CXX object src/gromacs/CMakeFiles/libgromacs.dir/selection/selection.cpp.o
1191
[ 95%] Building CXX object src/gromacs/CMakeFiles/libgromacs.dir/selection/selectioncollection.cpp.o
1192
[ 95%] Building CXX object src/gromacs/CMakeFiles/libgromacs.dir/selection/selectionoption.cpp.o
1193
[ 95%] Building CXX object src/gromacs/CMakeFiles/libgromacs.dir/selection/selectionoptionbehavior.cpp.o
1194
[ 95%] Building CXX object src/gromacs/CMakeFiles/libgromacs.dir/selection/selectionoptionmanager.cpp.o
1195
[ 95%] Building CXX object src/gromacs/CMakeFiles/libgromacs.dir/selection/selelem.cpp.o
1196
[ 95%] Building CXX object src/gromacs/CMakeFiles/libgromacs.dir/selection/selhelp.cpp.o
1197
[ 95%] Building CXX object src/gromacs/CMakeFiles/libgromacs.dir/selection/selmethod.cpp.o
1198
[ 95%] Building CXX object src/gromacs/CMakeFiles/libgromacs.dir/selection/selvalue.cpp.o
1199
[ 95%] Building CXX object src/gromacs/CMakeFiles/libgromacs.dir/selection/sm_compare.cpp.o
1200
[ 95%] Building CXX object src/gromacs/CMakeFiles/libgromacs.dir/selection/sm_distance.cpp.o
1201
[ 95%] Building CXX object src/gromacs/CMakeFiles/libgromacs.dir/selection/sm_insolidangle.cpp.o
1202
[ 96%] Building CXX object src/gromacs/CMakeFiles/libgromacs.dir/selection/sm_keywords.cpp.o
1203
[ 96%] Building CXX object src/gromacs/CMakeFiles/libgromacs.dir/selection/sm_merge.cpp.o
1204
[ 96%] Building CXX object src/gromacs/CMakeFiles/libgromacs.dir/selection/sm_permute.cpp.o
1205
[ 96%] Building CXX object src/gromacs/CMakeFiles/libgromacs.dir/selection/sm_position.cpp.o
1206
[ 96%] Building CXX object src/gromacs/CMakeFiles/libgromacs.dir/selection/sm_same.cpp.o
1207
[ 96%] Building CXX object src/gromacs/CMakeFiles/libgromacs.dir/selection/sm_simple.cpp.o
1208
[ 96%] Building CXX object src/gromacs/CMakeFiles/libgromacs.dir/selection/symrec.cpp.o
1209
[ 96%] Linking CXX shared library ../../lib/libgromacs.so
1210
[ 96%] Built target libgromacs
1211
Scanning dependencies of target template
1212
Scanning dependencies of target gmx
1213
[ 96%] Building CXX object share/template/CMakeFiles/template.dir/template.cpp.o
1214
[ 96%] Building CXX object src/programs/CMakeFiles/gmx.dir/gmx.cpp.o
1215
[ 96%] Building CXX object src/programs/CMakeFiles/gmx.dir/legacymodules.cpp.o
1216
Scanning dependencies of target gmxapi
1217
[ 96%] Building CXX object src/api/cpp/CMakeFiles/gmxapi.dir/context.cpp.o
1218
[ 96%] Building CXX object src/api/cpp/CMakeFiles/gmxapi.dir/exceptions.cpp.o
1219
[ 96%] Building CXX object src/api/cpp/CMakeFiles/gmxapi.dir/gmxapi.cpp.o
1220
[ 98%] Building CXX object src/api/cpp/CMakeFiles/gmxapi.dir/mdmodule.cpp.o
1221
[ 98%] Building CXX object src/api/cpp/CMakeFiles/gmxapi.dir/md.cpp.o
1222
[ 98%] Building CXX object src/api/cpp/CMakeFiles/gmxapi.dir/mdsignals.cpp.o
1223
[ 98%] Building CXX object src/api/cpp/CMakeFiles/gmxapi.dir/session.cpp.o
1224
[ 98%] Building CXX object src/api/cpp/CMakeFiles/gmxapi.dir/status.cpp.o
1225
[ 98%] Building CXX object src/api/cpp/CMakeFiles/gmxapi.dir/system.cpp.o
1226
[ 98%] Building CXX object src/api/cpp/CMakeFiles/gmxapi.dir/version.cpp.o
1227
[ 98%] Building CXX object src/api/cpp/CMakeFiles/gmxapi.dir/workflow.cpp.o
1228
[ 98%] Building CXX object src/api/cpp/CMakeFiles/gmxapi.dir/tpr.cpp.o
1229
[ 98%] Linking CXX executable ../../bin/gmx
1230
[ 98%] Linking CXX executable ../../bin/template
1231
[ 98%] Built target gmx
1232
Scanning dependencies of target completion
1233
[100%] Generating command-line completions for programs
1234
[100%] Built target completion
1235
[100%] Built target template
1236
[100%] Linking CXX shared library ../../../lib/libgmxapi.so
1237
[100%] Built target gmxapi
1238
+ /opt/cmake/3.14.5/bin/cmake --build . --target tests -- -j8 -k
1239
[  0%] Generating git version information
1240
[  0%] Built target tng_io_zlib
1241
[  0%] Built target linearalgebra
1242
[  0%] Built target lmfit_objlib
1243
[  2%] Built target tng_io_obj
1244
[  3%] Built target clFFT
1245
[  3%] Built target vmddlopen
1246
[  4%] Built target scanner
1247
[  5%] Built target modularsimulator
1248
[  7%] Built target thread_mpi
1249
[  7%] Built target mdrun_objlib
1250
Scanning dependencies of target gtest
1251
[  7%] Building CXX object src/external/googletest/googlemock/gtest/CMakeFiles/gtest.dir/src/gtest-all.cc.o
1252
[  7%] Built target git-version-info
1253
[ 68%] Built target libgromacs
1254
[ 69%] Built target gmxapi
1255
[ 69%] Linking CXX shared library ../../../../../lib/libgtest.so
1256
[ 69%] Built target gtest
1257
Scanning dependencies of target gmock
1258
[ 69%] Building CXX object src/external/googletest/googlemock/CMakeFiles/gmock.dir/src/gmock-all.cc.o
1259
[ 70%] Linking CXX shared library ../../../../lib/libgmock.so
1260
[ 70%] Built target gmock
1261
Scanning dependencies of target testutils
1262
[ 70%] Building CXX object src/testutils/CMakeFiles/testutils.dir/conftest.cpp.o
1263
[ 70%] Building CXX object src/testutils/CMakeFiles/testutils.dir/cmdlinetest.cpp.o
1264
[ 70%] Building CXX object src/testutils/CMakeFiles/testutils.dir/interactivetest.cpp.o
1265
[ 70%] Building CXX object src/testutils/CMakeFiles/testutils.dir/loggertest.cpp.o
1266
[ 70%] Building CXX object src/testutils/CMakeFiles/testutils.dir/filematchers.cpp.o
1267
[ 70%] Building CXX object src/testutils/CMakeFiles/testutils.dir/mpi_printer.cpp.o
1268
[ 70%] Building CXX object src/testutils/CMakeFiles/testutils.dir/refdata.cpp.o
1269
[ 71%] Building CXX object src/testutils/CMakeFiles/testutils.dir/mpitest.cpp.o
1270
[ 71%] Building CXX object src/testutils/CMakeFiles/testutils.dir/refdata_xml.cpp.o
1271
[ 71%] Building CXX object src/testutils/CMakeFiles/testutils.dir/simulationdatabase.cpp.o
1272
[ 71%] Building CXX object src/testutils/CMakeFiles/testutils.dir/stdiohelper.cpp.o
1273
[ 71%] Building CXX object src/testutils/CMakeFiles/testutils.dir/stringtest.cpp.o
1274
[ 71%] Building CXX object src/testutils/CMakeFiles/testutils.dir/testasserts.cpp.o
1275
[ 71%] Building CXX object src/testutils/CMakeFiles/testutils.dir/testfilemanager.cpp.o
1276
[ 71%] Building CXX object src/testutils/CMakeFiles/testutils.dir/testfileredirector.cpp.o
1277
[ 71%] Building CXX object src/testutils/CMakeFiles/testutils.dir/testinit.cpp.o
1278
[ 71%] Building CXX object src/testutils/CMakeFiles/testutils.dir/testmatchers.cpp.o
1279
[ 71%] Building CXX object src/testutils/CMakeFiles/testutils.dir/testoptions.cpp.o
1280
[ 71%] Building CXX object src/testutils/CMakeFiles/testutils.dir/textblockmatchers.cpp.o
1281
[ 71%] Building CXX object src/testutils/CMakeFiles/testutils.dir/tprfilegenerator.cpp.o
1282
[ 71%] Building CXX object src/testutils/CMakeFiles/testutils.dir/xvgtest.cpp.o
1283
[ 72%] Building CXX object src/testutils/CMakeFiles/testutils.dir/__/external/tinyxml2/tinyxml2.cpp.o
1284
[ 72%] Linking CXX static library ../../lib/libtestutils.a
1285
[ 72%] Built target testutils
1286
Scanning dependencies of target testutils-mpi-test
1287
Scanning dependencies of target utility-mpi-test
1288
[ 72%] Building CXX object src/testutils/tests/CMakeFiles/testutils-mpi-test.dir/mpitest.cpp.o
1289
[ 72%] Building CXX object src/gromacs/utility/tests/CMakeFiles/utility-mpi-test.dir/physicalnodecommunicator_mpi.cpp.o
1290
Scanning dependencies of target testutils-test
1291
Scanning dependencies of target listed_forces-test
1292
[ 72%] Building CXX object src/testutils/tests/CMakeFiles/testutils-test.dir/interactivetest.cpp.o
1293
Scanning dependencies of target mdrun_test_infrastructure
1294
[ 72%] Building CXX object src/gromacs/listed_forces/tests/CMakeFiles/listed_forces-test.dir/bonded.cpp.o
1295
[ 72%] Building CXX object src/programs/mdrun/tests/CMakeFiles/mdrun_test_infrastructure.dir/energyreader.cpp.o
1296
Scanning dependencies of target applied_forces-test
1297
[ 72%] Building CXX object src/gromacs/applied_forces/tests/CMakeFiles/applied_forces-test.dir/densityfitting.cpp.o
1298
Scanning dependencies of target utility-test
1299
[ 72%] Building CXX object src/gromacs/utility/tests/CMakeFiles/utility-test.dir/alignedallocator.cpp.o
1300
Scanning dependencies of target mdlib-test
1301
[ 72%] Building CXX object src/gromacs/mdlib/tests/CMakeFiles/mdlib-test.dir/calc_verletbuf.cpp.o
1302
[ 72%] Building CXX object src/programs/mdrun/tests/CMakeFiles/mdrun_test_infrastructure.dir/energycomparison.cpp.o
1303
[ 72%] Building CXX object src/programs/mdrun/tests/CMakeFiles/mdrun_test_infrastructure.dir/moduletest.cpp.o
1304
[ 72%] Building CXX object src/programs/mdrun/tests/CMakeFiles/mdrun_test_infrastructure.dir/mdmodulenotification.cpp.o
1305
[ 72%] Building CXX object src/testutils/tests/CMakeFiles/testutils-mpi-test.dir/__/unittest_main.cpp.o
1306
[ 72%] Building CXX object src/gromacs/mdlib/tests/CMakeFiles/mdlib-test.dir/constr.cpp.o
1307
[ 72%] Building CXX object src/gromacs/utility/tests/CMakeFiles/utility-test.dir/arrayref.cpp.o
1308
[ 72%] Building CXX object src/testutils/tests/CMakeFiles/testutils-test.dir/refdata_tests.cpp.o
1309
[ 72%] Building CXX object src/programs/mdrun/tests/CMakeFiles/mdrun_test_infrastructure.dir/terminationhelper.cpp.o
1310
[ 72%] Building CXX object src/programs/mdrun/tests/CMakeFiles/mdrun_test_infrastructure.dir/trajectorycomparison.cpp.o
1311
[ 72%] Building CXX object src/gromacs/utility/tests/CMakeFiles/utility-mpi-test.dir/__/__/__/testutils/unittest_main.cpp.o
1312
[ 73%] Building CXX object src/gromacs/listed_forces/tests/CMakeFiles/listed_forces-test.dir/__/__/__/testutils/unittest_main.cpp.o
1313
[ 73%] Building CXX object src/gromacs/applied_forces/tests/CMakeFiles/applied_forces-test.dir/densityfittingoptions.cpp.o
1314
[ 73%] Building CXX object src/programs/mdrun/tests/CMakeFiles/mdrun_test_infrastructure.dir/trajectoryreader.cpp.o
1315
[ 73%] Linking CXX executable ../../../bin/testutils-mpi-test
1316
[ 73%] Built target testutils-mpi-test
1317
[ 73%] Building CXX object src/gromacs/applied_forces/tests/CMakeFiles/applied_forces-test.dir/densityfittingamplitudelookup.cpp.o
1318
[ 73%] Linking CXX static library ../../../../lib/libmdrun_test_infrastructure.a
1319
[ 73%] Built target mdrun_test_infrastructure
1320
[ 73%] Building CXX object src/gromacs/applied_forces/tests/CMakeFiles/applied_forces-test.dir/electricfield.cpp.o
1321
[ 73%] Linking CXX executable ../../../../bin/utility-mpi-test
1322
[ 73%] Building CXX object src/gromacs/mdlib/tests/CMakeFiles/mdlib-test.dir/constrtestdata.cpp.o
1323
[ 73%] Built target utility-mpi-test
1324
[ 73%] Building CXX object src/gromacs/mdlib/tests/CMakeFiles/mdlib-test.dir/constrtestrunners.cpp.o
1325
[ 73%] Linking CXX executable ../../../../bin/listed_forces-test
1326
[ 73%] Built target listed_forces-test
1327
[ 75%] Building CXX object src/gromacs/utility/tests/CMakeFiles/utility-test.dir/bitmask32.cpp.o
1328
Scanning dependencies of target onlinehelp-test-shared
1329
[ 75%] Building CXX object src/gromacs/onlinehelp/tests/CMakeFiles/onlinehelp-test-shared.dir/mock_helptopic.cpp.o
1330
[ 75%] Building CXX object src/testutils/tests/CMakeFiles/testutils-test.dir/testasserts_tests.cpp.o
1331
[ 75%] Linking CXX static library ../../../../lib/libonlinehelp-test-shared.a
1332
[ 75%] Built target onlinehelp-test-shared
1333
[ 75%] Building CXX object src/testutils/tests/CMakeFiles/testutils-test.dir/xvgtest_tests.cpp.o
1334
[ 75%] Building CXX object src/testutils/tests/CMakeFiles/testutils-test.dir/__/unittest_main.cpp.o
1335
[ 75%] Building CXX object src/gromacs/utility/tests/CMakeFiles/utility-test.dir/bitmask64.cpp.o
1336
[ 75%] Building CXX object src/gromacs/utility/tests/CMakeFiles/utility-test.dir/bitmask128.cpp.o
1337
[ 76%] Building CXX object src/gromacs/applied_forces/tests/CMakeFiles/applied_forces-test.dir/__/__/__/testutils/unittest_main.cpp.o
1338
[ 76%] Building CXX object src/gromacs/utility/tests/CMakeFiles/utility-test.dir/cstringutil.cpp.o
1339
[ 76%] Building CXX object src/gromacs/mdlib/tests/CMakeFiles/mdlib-test.dir/ebin.cpp.o
1340
[ 76%] Building CXX object src/gromacs/mdlib/tests/CMakeFiles/mdlib-test.dir/energyoutput.cpp.o
1341
[ 76%] Building CXX object src/gromacs/mdlib/tests/CMakeFiles/mdlib-test.dir/leapfrog.cpp.o
1342
[ 76%] Building CXX object src/gromacs/mdlib/tests/CMakeFiles/mdlib-test.dir/leapfrogtestdata.cpp.o
1343
[ 76%] Linking CXX executable ../../../bin/testutils-test
1344
[ 76%] Built target testutils-test
1345
[ 76%] Building CXX object src/gromacs/mdlib/tests/CMakeFiles/mdlib-test.dir/leapfrogtestrunners.cpp.o
1346
[ 76%] Building CXX object src/gromacs/mdlib/tests/CMakeFiles/mdlib-test.dir/settle.cpp.o
1347
Scanning dependencies of target domdec-test
1348
[ 76%] Building CXX object src/gromacs/domdec/tests/CMakeFiles/domdec-test.dir/hashedmap.cpp.o
1349
[ 76%] Linking CXX executable ../../../../bin/applied_forces-test
1350
[ 76%] Built target applied_forces-test
1351
[ 76%] Building CXX object src/gromacs/domdec/tests/CMakeFiles/domdec-test.dir/localatomsetmanager.cpp.o
1352
[ 76%] Building CXX object src/gromacs/utility/tests/CMakeFiles/utility-test.dir/defaultinitializationallocator.cpp.o
1353
[ 76%] Building CXX object src/gromacs/utility/tests/CMakeFiles/utility-test.dir/enumerationhelpers.cpp.o
1354
[ 76%] Building CXX object src/gromacs/utility/tests/CMakeFiles/utility-test.dir/fixedcapacityvector.cpp.o
1355
[ 76%] Building CXX object src/gromacs/utility/tests/CMakeFiles/utility-test.dir/inmemoryserializer.cpp.o
1356
[ 76%] Building CXX object src/gromacs/utility/tests/CMakeFiles/utility-test.dir/keyvaluetreeserializer.cpp.o
1357
[ 76%] Building CXX object src/gromacs/mdlib/tests/CMakeFiles/mdlib-test.dir/settletestdata.cpp.o
1358
[ 77%] Building CXX object src/gromacs/mdlib/tests/CMakeFiles/mdlib-test.dir/settletestrunners.cpp.o
1359
[ 77%] Building CXX object src/gromacs/mdlib/tests/CMakeFiles/mdlib-test.dir/shake.cpp.o
1360
[ 77%] Building CXX object src/gromacs/mdlib/tests/CMakeFiles/mdlib-test.dir/simulationsignal.cpp.o
1361
[ 77%] Building CXX object src/gromacs/domdec/tests/CMakeFiles/domdec-test.dir/__/__/__/testutils/unittest_main.cpp.o
1362
[ 77%] Building CXX object src/gromacs/mdlib/tests/CMakeFiles/mdlib-test.dir/updategroups.cpp.o
1363
[ 77%] Building CXX object src/gromacs/mdlib/tests/CMakeFiles/mdlib-test.dir/updategroupscog.cpp.o
1364
Scanning dependencies of target ewald-test
1365
[ 77%] Building CXX object src/gromacs/ewald/tests/CMakeFiles/ewald-test.dir/pmebsplinetest.cpp.o
1366
[ 77%] Building CXX object src/gromacs/ewald/tests/CMakeFiles/ewald-test.dir/pmegathertest.cpp.o
1367
[ 77%] Building CXX object src/gromacs/ewald/tests/CMakeFiles/ewald-test.dir/pmesolvetest.cpp.o
1368
[ 77%] Building CXX object src/gromacs/ewald/tests/CMakeFiles/ewald-test.dir/pmesplinespreadtest.cpp.o
1369
[ 77%] Building CXX object src/gromacs/utility/tests/CMakeFiles/utility-test.dir/keyvaluetreetransform.cpp.o
1370
[ 77%] Linking CXX executable ../../../../bin/domdec-test
1371
[ 77%] Built target domdec-test
1372
[ 77%] Building CXX object src/gromacs/utility/tests/CMakeFiles/utility-test.dir/logger.cpp.o
1373
[ 77%] Building CXX object src/gromacs/utility/tests/CMakeFiles/utility-test.dir/mutex.cpp.o
1374
[ 77%] Building CXX object src/gromacs/mdlib/tests/CMakeFiles/mdlib-test.dir/__/__/__/testutils/unittest_main.cpp.o
1375
[ 77%] Building CXX object src/gromacs/ewald/tests/CMakeFiles/ewald-test.dir/pmetestcommon.cpp.o
1376
[ 77%] Building CXX object src/gromacs/utility/tests/CMakeFiles/utility-test.dir/path.cpp.o
1377
[ 77%] Building CXX object src/gromacs/utility/tests/CMakeFiles/utility-test.dir/physicalnodecommunicator.cpp.o
1378
[ 77%] Building CXX object src/gromacs/ewald/tests/CMakeFiles/ewald-test.dir/testhardwarecontexts.cpp.o
1379
[ 78%] Building CXX object src/gromacs/utility/tests/CMakeFiles/utility-test.dir/stringutil.cpp.o
1380
[ 78%] Building CXX object src/gromacs/utility/tests/CMakeFiles/utility-test.dir/textreader.cpp.o
1381
[ 78%] Linking CXX executable ../../../../bin/mdlib-test
1382
[ 78%] Building CXX object src/gromacs/ewald/tests/CMakeFiles/ewald-test.dir/__/__/__/testutils/unittest_main.cpp.o
1383
[ 78%] Built target mdlib-test
1384
[ 78%] Building CXX object src/gromacs/utility/tests/CMakeFiles/utility-test.dir/textwriter.cpp.o
1385
Scanning dependencies of target fft-test
1386
[ 79%] Building CXX object src/gromacs/fft/tests/CMakeFiles/fft-test.dir/fft.cpp.o
1387
[ 79%] Building CXX object src/gromacs/fft/tests/CMakeFiles/fft-test.dir/__/__/__/testutils/unittest_main.cpp.o
1388
Scanning dependencies of target gpu_utils-test
1389
[ 79%] Building CXX object src/gromacs/gpu_utils/tests/CMakeFiles/gpu_utils-test.dir/gputest.cpp.o
1390
[ 79%] Building CXX object src/gromacs/gpu_utils/tests/CMakeFiles/gpu_utils-test.dir/clfftinitializer.cpp.o
1391
[ 79%] Building CXX object src/gromacs/gpu_utils/tests/CMakeFiles/gpu_utils-test.dir/hostallocator.cpp.o
1392
Scanning dependencies of target hardware-test
1393
[ 79%] Building CXX object src/gromacs/hardware/tests/CMakeFiles/hardware-test.dir/cpuinfo.cpp.o
1394
[ 79%] Building CXX object src/gromacs/utility/tests/CMakeFiles/utility-test.dir/typetraits.cpp.o
1395
[ 79%] Building CXX object src/gromacs/utility/tests/CMakeFiles/utility-test.dir/__/__/__/testutils/unittest_main.cpp.o
1396
[ 79%] Linking CXX executable ../../../../bin/ewald-test
1397
Scanning dependencies of target math-test
1398
[ 79%] Building CXX object src/gromacs/math/tests/CMakeFiles/math-test.dir/arrayrefwithpadding.cpp.o
1399
[ 79%] Built target ewald-test
1400
[ 79%] Building CXX object src/gromacs/math/tests/CMakeFiles/math-test.dir/coordinatetransformation.cpp.o
1401
[ 79%] Linking CXX executable ../../../../bin/fft-test
1402
[ 79%] Built target fft-test
1403
[ 79%] Building CXX object src/gromacs/math/tests/CMakeFiles/math-test.dir/densityfit.cpp.o
1404
[ 79%] Building CXX object src/gromacs/math/tests/CMakeFiles/math-test.dir/dofit.cpp.o
1405
[ 79%] Building CXX object src/gromacs/gpu_utils/tests/CMakeFiles/gpu_utils-test.dir/devicetransfers_ocl.cpp.o
1406
[ 79%] Building CXX object src/gromacs/gpu_utils/tests/CMakeFiles/gpu_utils-test.dir/__/__/__/testutils/unittest_main.cpp.o
1407
[ 79%] Building CXX object src/gromacs/hardware/tests/CMakeFiles/hardware-test.dir/hardwaretopology.cpp.o
1408
[ 80%] Building CXX object src/gromacs/hardware/tests/CMakeFiles/hardware-test.dir/__/__/__/testutils/unittest_main.cpp.o
1409
[ 80%] Linking CXX executable ../../../../bin/utility-test
1410
[ 80%] Building CXX object src/gromacs/math/tests/CMakeFiles/math-test.dir/exponentialmovingaverage.cpp.o
1411
[ 80%] Built target utility-test
1412
[ 80%] Building CXX object src/gromacs/math/tests/CMakeFiles/math-test.dir/functions.cpp.o
1413
[ 80%] Building CXX object src/gromacs/math/tests/CMakeFiles/math-test.dir/gausstransform.cpp.o
1414
Scanning dependencies of target mdrunutility-test-shared
1415
[ 80%] Building CXX object src/gromacs/mdrunutility/tests/CMakeFiles/mdrunutility-test-shared.dir/threadaffinitytest.cpp.o
1416
Scanning dependencies of target mdspan-test
1417
[ 80%] Building CXX object src/gromacs/mdspan/tests/CMakeFiles/mdspan-test.dir/accessor_policy.cpp.o
1418
[ 80%] Linking CXX executable ../../../../bin/gpu_utils-test
1419
[ 80%] Linking CXX static library ../../../../lib/libmdrunutility-test-shared.a
1420
[ 80%] Built target mdrunutility-test-shared
1421
[ 80%] Building CXX object src/gromacs/mdspan/tests/CMakeFiles/mdspan-test.dir/extents.cpp.o
1422
[ 80%] Built target gpu_utils-test
1423
[ 80%] Building CXX object src/gromacs/mdspan/tests/CMakeFiles/mdspan-test.dir/extensions.cpp.o
1424
[ 80%] Building CXX object src/gromacs/mdspan/tests/CMakeFiles/mdspan-test.dir/layouts.cpp.o
1425
[ 80%] Linking CXX executable ../../../../bin/hardware-test
1426
[ 80%] Built target hardware-test
1427
[ 80%] Building CXX object src/gromacs/mdspan/tests/CMakeFiles/mdspan-test.dir/mdspan.cpp.o
1428
[ 80%] Building CXX object src/gromacs/mdspan/tests/CMakeFiles/mdspan-test.dir/__/__/__/testutils/unittest_main.cpp.o
1429
Scanning dependencies of target onlinehelp-test
1430
[ 80%] Building CXX object src/gromacs/onlinehelp/tests/CMakeFiles/onlinehelp-test.dir/helpformat.cpp.o
1431
[ 80%] Building CXX object src/gromacs/onlinehelp/tests/CMakeFiles/onlinehelp-test.dir/helpmanager.cpp.o
1432
[ 80%] Building CXX object src/gromacs/math/tests/CMakeFiles/math-test.dir/densityfittingforce.cpp.o
1433
[ 80%] Building CXX object src/gromacs/math/tests/CMakeFiles/math-test.dir/invertmatrix.cpp.o
1434
[ 80%] Building CXX object src/gromacs/math/tests/CMakeFiles/math-test.dir/matrix.cpp.o
1435
Scanning dependencies of target options-test
1436
[ 80%] Building CXX object src/gromacs/options/tests/CMakeFiles/options-test.dir/abstractoptionstorage.cpp.o
1437
[ 80%] Building CXX object src/gromacs/options/tests/CMakeFiles/options-test.dir/filenameoption.cpp.o
1438
[ 80%] Building CXX object src/gromacs/options/tests/CMakeFiles/options-test.dir/filenameoptionmanager.cpp.o
1439
[ 80%] Linking CXX executable ../../../../bin/mdspan-test
1440
[ 80%] Built target mdspan-test
1441
[ 80%] Building CXX object src/gromacs/onlinehelp/tests/CMakeFiles/onlinehelp-test.dir/helpwritercontext.cpp.o
1442
Scanning dependencies of target pbcutil-test
1443
[ 80%] Building CXX object src/gromacs/pbcutil/tests/CMakeFiles/pbcutil-test.dir/pbc.cpp.o
1444
[ 80%] Building CXX object src/gromacs/pbcutil/tests/CMakeFiles/pbcutil-test.dir/pbcenums.cpp.o
1445
[ 80%] Building CXX object src/gromacs/pbcutil/tests/CMakeFiles/pbcutil-test.dir/__/__/__/testutils/unittest_main.cpp.o
1446
[ 80%] Building CXX object src/gromacs/math/tests/CMakeFiles/math-test.dir/multidimarray.cpp.o
1447
[ 80%] Building CXX object src/gromacs/math/tests/CMakeFiles/math-test.dir/paddedvector.cpp.o
1448
[ 80%] Building CXX object src/gromacs/onlinehelp/tests/CMakeFiles/onlinehelp-test.dir/__/__/__/testutils/unittest_main.cpp.o
1449
[ 81%] Building CXX object src/gromacs/math/tests/CMakeFiles/math-test.dir/vectypes.cpp.o
1450
[ 82%] Building CXX object src/gromacs/options/tests/CMakeFiles/options-test.dir/option.cpp.o
1451
Scanning dependencies of target random-test
1452
[ 82%] Building CXX object src/gromacs/random/tests/CMakeFiles/random-test.dir/exponentialdistribution.cpp.o
1453
[ 82%] Building CXX object src/gromacs/random/tests/CMakeFiles/random-test.dir/gammadistribution.cpp.o
1454
[ 82%] Linking CXX executable ../../../../bin/pbcutil-test
1455
[ 82%] Built target pbcutil-test
1456
[ 82%] Building CXX object src/gromacs/math/tests/CMakeFiles/math-test.dir/__/__/__/testutils/unittest_main.cpp.o
1457
Scanning dependencies of target restraintpotential-test
1458
[ 82%] Building CXX object src/gromacs/restraint/tests/CMakeFiles/restraintpotential-test.dir/manager.cpp.o
1459
[ 82%] Linking CXX executable ../../../../bin/onlinehelp-test
1460
[ 82%] Built target onlinehelp-test
1461
[ 82%] Building CXX object src/gromacs/restraint/tests/CMakeFiles/restraintpotential-test.dir/__/__/__/testutils/unittest_main.cpp.o
1462
Scanning dependencies of target table-test
1463
[ 82%] Building CXX object src/gromacs/tables/tests/CMakeFiles/table-test.dir/splinetable.cpp.o
1464
[ 82%] Building CXX object src/gromacs/tables/tests/CMakeFiles/table-test.dir/__/__/__/testutils/unittest_main.cpp.o
1465
[ 82%] Building CXX object src/gromacs/options/tests/CMakeFiles/options-test.dir/optionsassigner.cpp.o
1466
Scanning dependencies of target taskassignment-test
1467
[ 82%] Building CXX object src/gromacs/taskassignment/tests/CMakeFiles/taskassignment-test.dir/usergpuids.cpp.o
1468
[ 82%] Building CXX object src/gromacs/random/tests/CMakeFiles/random-test.dir/normaldistribution.cpp.o
1469
[ 82%] Linking CXX executable ../../../../bin/math-test
1470
[ 82%] Built target math-test
1471
[ 82%] Building CXX object src/gromacs/random/tests/CMakeFiles/random-test.dir/seed.cpp.o
1472
[ 82%] Building CXX object src/gromacs/random/tests/CMakeFiles/random-test.dir/tabulatednormaldistribution.cpp.o
1473
[ 82%] Linking CXX executable ../../../../bin/restraintpotential-test
1474
[ 82%] Built target restraintpotential-test
1475
[ 82%] Building CXX object src/gromacs/random/tests/CMakeFiles/random-test.dir/threefry.cpp.o
1476
[ 84%] Building CXX object src/gromacs/random/tests/CMakeFiles/random-test.dir/uniformintdistribution.cpp.o
1477
[ 85%] Linking CXX executable ../../../../bin/table-test
1478
[ 85%] Building CXX object src/gromacs/options/tests/CMakeFiles/options-test.dir/repeatingsection.cpp.o
1479
[ 85%] Built target table-test
1480
[ 85%] Building CXX object src/gromacs/options/tests/CMakeFiles/options-test.dir/timeunitmanager.cpp.o
1481
[ 85%] Building CXX object src/gromacs/options/tests/CMakeFiles/options-test.dir/treesupport.cpp.o
1482
[ 85%] Building CXX object src/gromacs/options/tests/CMakeFiles/options-test.dir/__/__/__/testutils/unittest_main.cpp.o
1483
[ 85%] Building CXX object src/gromacs/taskassignment/tests/CMakeFiles/taskassignment-test.dir/__/__/__/testutils/unittest_main.cpp.o
1484
Scanning dependencies of target topology-test
1485
[ 85%] Building CXX object src/gromacs/topology/tests/CMakeFiles/topology-test.dir/exclusionblocks.cpp.o
1486
[ 85%] Building CXX object src/gromacs/topology/tests/CMakeFiles/topology-test.dir/mtop.cpp.o
1487
[ 85%] Building CXX object src/gromacs/random/tests/CMakeFiles/random-test.dir/uniformrealdistribution.cpp.o
1488
[ 85%] Linking CXX executable ../../../../bin/taskassignment-test
1489
[ 85%] Building CXX object src/gromacs/random/tests/CMakeFiles/random-test.dir/__/__/__/testutils/unittest_main.cpp.o
1490
[ 85%] Built target taskassignment-test
1491
[ 85%] Building CXX object src/gromacs/topology/tests/CMakeFiles/topology-test.dir/symtab.cpp.o
1492
[ 85%] Building CXX object src/gromacs/topology/tests/CMakeFiles/topology-test.dir/__/__/__/testutils/unittest_main.cpp.o
1493
Scanning dependencies of target pull-test
1494
[ 85%] Building CXX object src/gromacs/pulling/tests/CMakeFiles/pull-test.dir/pull.cpp.o
1495
[ 85%] Linking CXX executable ../../../../bin/options-test
1496
[ 85%] Building CXX object src/gromacs/pulling/tests/CMakeFiles/pull-test.dir/__/__/__/testutils/unittest_main.cpp.o
1497
[ 85%] Built target options-test
1498
Scanning dependencies of target awh-test
1499
[ 85%] Building CXX object src/gromacs/awh/tests/CMakeFiles/awh-test.dir/bias.cpp.o
1500
[ 85%] Building CXX object src/gromacs/awh/tests/CMakeFiles/awh-test.dir/biasstate.cpp.o
1501
[ 85%] Building CXX object src/gromacs/awh/tests/CMakeFiles/awh-test.dir/grid.cpp.o
1502
[ 85%] Linking CXX executable ../../../../bin/random-test
1503
Scanning dependencies of target simd-test
1504
[ 85%] Building CXX object src/gromacs/simd/tests/CMakeFiles/simd-test.dir/bootstrap_loadstore.cpp.o
1505
[ 85%] Built target random-test
1506
[ 85%] Building CXX object src/gromacs/simd/tests/CMakeFiles/simd-test.dir/base.cpp.o
1507
[ 85%] Linking CXX executable ../../../../bin/topology-test
1508
[ 85%] Building CXX object src/gromacs/simd/tests/CMakeFiles/simd-test.dir/simd.cpp.o
1509
[ 85%] Built target topology-test
1510
[ 85%] Building CXX object src/gromacs/simd/tests/CMakeFiles/simd-test.dir/simd_floatingpoint.cpp.o
1511
[ 85%] Linking CXX executable ../../../../bin/pull-test
1512
[ 85%] Built target pull-test
1513
[ 85%] Building CXX object src/gromacs/simd/tests/CMakeFiles/simd-test.dir/simd_floatingpoint_util.cpp.o
1514
[ 86%] Building CXX object src/gromacs/simd/tests/CMakeFiles/simd-test.dir/simd_vector_operations.cpp.o
1515
[ 86%] Building CXX object src/gromacs/awh/tests/CMakeFiles/awh-test.dir/__/__/__/testutils/unittest_main.cpp.o
1516
Scanning dependencies of target compat-test
1517
[ 86%] Building CXX object src/gromacs/compat/tests/CMakeFiles/compat-test.dir/optional.cpp.o
1518
[ 86%] Building CXX object src/gromacs/compat/tests/CMakeFiles/compat-test.dir/pointers.cpp.o
1519
[ 86%] Building CXX object src/gromacs/compat/tests/CMakeFiles/compat-test.dir/string_view.cpp.o
1520
[ 86%] Building CXX object src/gromacs/compat/tests/CMakeFiles/compat-test.dir/__/__/__/testutils/unittest_main.cpp.o
1521
Scanning dependencies of target gmxana-test
1522
[ 86%] Building CXX object src/gromacs/gmxana/tests/CMakeFiles/gmxana-test.dir/entropy.cpp.o
1523
[ 86%] Building CXX object src/gromacs/gmxana/tests/CMakeFiles/gmxana-test.dir/gmx_traj.cpp.o
1524
[ 86%] Building CXX object src/gromacs/simd/tests/CMakeFiles/simd-test.dir/simd_math.cpp.o
1525
[ 86%] Building CXX object src/gromacs/simd/tests/CMakeFiles/simd-test.dir/simd_memory.cpp.o
1526
[ 86%] Linking CXX executable ../../../../bin/awh-test
1527
[ 86%] Built target awh-test
1528
[ 86%] Building CXX object src/gromacs/simd/tests/CMakeFiles/simd-test.dir/simd_integer.cpp.o
1529
[ 86%] Building CXX object src/gromacs/simd/tests/CMakeFiles/simd-test.dir/simd4.cpp.o
1530
[ 86%] Building CXX object src/gromacs/gmxana/tests/CMakeFiles/gmxana-test.dir/gmx_mindist.cpp.o
1531
[ 86%] Building CXX object src/gromacs/simd/tests/CMakeFiles/simd-test.dir/simd4_floatingpoint.cpp.o
1532
[ 86%] Building CXX object src/gromacs/simd/tests/CMakeFiles/simd-test.dir/simd4_vector_operations.cpp.o
1533
[ 86%] Linking CXX executable ../../../../bin/compat-test
1534
[ 86%] Built target compat-test
1535
[ 86%] Building CXX object src/gromacs/simd/tests/CMakeFiles/simd-test.dir/simd4_math.cpp.o
1536
Scanning dependencies of target pdb2gmx1-test
1537
[ 86%] Building CXX object src/gromacs/gmxpreprocess/tests/CMakeFiles/pdb2gmx1-test.dir/pdb2gmx.cpp.o
1538
[ 86%] Building CXX object src/gromacs/gmxana/tests/CMakeFiles/gmxana-test.dir/gmx_msd.cpp.o
1539
[ 86%] Building CXX object src/gromacs/gmxana/tests/CMakeFiles/gmxana-test.dir/__/__/__/testutils/unittest_main.cpp.o
1540
[ 86%] Building CXX object src/gromacs/gmxpreprocess/tests/CMakeFiles/pdb2gmx1-test.dir/__/__/__/testutils/unittest_main.cpp.o
1541
Scanning dependencies of target gmxpreprocess-test
1542
[ 86%] Building CXX object src/gromacs/gmxpreprocess/tests/CMakeFiles/gmxpreprocess-test.dir/editconf.cpp.o
1543
[ 86%] Building CXX object src/gromacs/gmxpreprocess/tests/CMakeFiles/gmxpreprocess-test.dir/genconf.cpp.o
1544
[ 86%] Building CXX object src/gromacs/gmxpreprocess/tests/CMakeFiles/gmxpreprocess-test.dir/genion.cpp.o
1545
[ 86%] Building CXX object src/gromacs/simd/tests/CMakeFiles/simd-test.dir/scalar.cpp.o
1546
[ 86%] Building CXX object src/gromacs/simd/tests/CMakeFiles/simd-test.dir/scalar_util.cpp.o
1547
Scanning dependencies of target pdb2gmx2-test
1548
[ 87%] Building CXX object src/gromacs/gmxpreprocess/tests/CMakeFiles/pdb2gmx2-test.dir/pdb2gmx.cpp.o
1549
[ 87%] Linking CXX executable ../../../../bin/gmxana-test
1550
[ 87%] Built target gmxana-test
1551
[ 87%] Building CXX object src/gromacs/gmxpreprocess/tests/CMakeFiles/gmxpreprocess-test.dir/gpp_atomtype.cpp.o
1552
[ 87%] Linking CXX executable ../../../../bin/pdb2gmx1-test
1553
[ 87%] Built target pdb2gmx1-test
1554
[ 87%] Building CXX object src/gromacs/gmxpreprocess/tests/CMakeFiles/gmxpreprocess-test.dir/gpp_bond_atomtype.cpp.o
1555
Scanning dependencies of target pdb2gmx3-test
1556
[ 87%] Building CXX object src/gromacs/gmxpreprocess/tests/CMakeFiles/pdb2gmx3-test.dir/pdb2gmx.cpp.o
1557
[ 87%] Building CXX object src/gromacs/gmxpreprocess/tests/CMakeFiles/pdb2gmx3-test.dir/__/__/__/testutils/unittest_main.cpp.o
1558
[ 87%] Building CXX object src/gromacs/gmxpreprocess/tests/CMakeFiles/pdb2gmx2-test.dir/__/__/__/testutils/unittest_main.cpp.o
1559
[ 87%] Building CXX object src/gromacs/gmxpreprocess/tests/CMakeFiles/gmxpreprocess-test.dir/insert_molecules.cpp.o
1560
[ 87%] Building CXX object src/gromacs/simd/tests/CMakeFiles/simd-test.dir/scalar_math.cpp.o
1561
[ 87%] Building CXX object src/gromacs/simd/tests/CMakeFiles/simd-test.dir/__/__/__/testutils/unittest_main.cpp.o
1562
Scanning dependencies of target correlations-test
1563
[ 87%] Building CXX object src/gromacs/correlationfunctions/tests/CMakeFiles/correlations-test.dir/autocorr.cpp.o
1564
[ 87%] Building CXX object src/gromacs/correlationfunctions/tests/CMakeFiles/correlations-test.dir/manyautocorrelation.cpp.o
1565
[ 87%] Building CXX object src/gromacs/correlationfunctions/tests/CMakeFiles/correlations-test.dir/correlationdataset.cpp.o
1566
[ 87%] Linking CXX executable ../../../../bin/pdb2gmx3-test
1567
[ 87%] Linking CXX executable ../../../../bin/pdb2gmx2-test
1568
[ 87%] Built target pdb2gmx3-test
1569
[ 88%] Building CXX object src/gromacs/correlationfunctions/tests/CMakeFiles/correlations-test.dir/expfit.cpp.o
1570
[ 88%] Built target pdb2gmx2-test
1571
[ 88%] Building CXX object src/gromacs/correlationfunctions/tests/CMakeFiles/correlations-test.dir/__/__/__/testutils/unittest_main.cpp.o
1572
Scanning dependencies of target analysisdata-test-shared
1573
[ 88%] Building CXX object src/gromacs/analysisdata/tests/CMakeFiles/analysisdata-test-shared.dir/datatest.cpp.o
1574
[ 88%] Building CXX object src/gromacs/gmxpreprocess/tests/CMakeFiles/gmxpreprocess-test.dir/readir.cpp.o
1575
[ 88%] Building CXX object src/gromacs/analysisdata/tests/CMakeFiles/analysisdata-test-shared.dir/mock_datamodule.cpp.o
1576
[ 88%] Building CXX object src/gromacs/gmxpreprocess/tests/CMakeFiles/gmxpreprocess-test.dir/solvate.cpp.o
1577
[ 88%] Linking CXX executable ../../../../bin/simd-test
1578
[ 88%] Built target simd-test
1579
[ 89%] Building CXX object src/gromacs/gmxpreprocess/tests/CMakeFiles/gmxpreprocess-test.dir/topdirs.cpp.o
1580
[ 89%] Building CXX object src/gromacs/gmxpreprocess/tests/CMakeFiles/gmxpreprocess-test.dir/__/__/__/testutils/unittest_main.cpp.o
1581
Scanning dependencies of target coordinateio-test
1582
[ 89%] Building CXX object src/gromacs/coordinateio/tests/CMakeFiles/coordinateio-test.dir/builder.cpp.o
1583
[ 89%] Building CXX object src/gromacs/coordinateio/tests/CMakeFiles/coordinateio-test.dir/outputadaptercontainer.cpp.o
1584
[ 89%] Linking CXX executable ../../../../bin/correlations-test
1585
[ 89%] Linking CXX static library ../../../../lib/libanalysisdata-test-shared.a
1586
[ 89%] Built target analysisdata-test-shared
1587
[ 89%] Building CXX object src/gromacs/coordinateio/tests/CMakeFiles/coordinateio-test.dir/outputadapters.cpp.o
1588
[ 89%] Built target correlations-test
1589
[ 89%] Building CXX object src/gromacs/coordinateio/tests/CMakeFiles/coordinateio-test.dir/requirements.cpp.o
1590
Scanning dependencies of target energyanalysis-test
1591
[ 89%] Building CXX object src/gromacs/energyanalysis/tests/CMakeFiles/energyanalysis-test.dir/legacyenergy.cpp.o
1592
[ 89%] Building CXX object src/gromacs/energyanalysis/tests/CMakeFiles/energyanalysis-test.dir/__/__/__/testutils/unittest_main.cpp.o
1593
[ 89%] Building CXX object src/gromacs/coordinateio/tests/CMakeFiles/coordinateio-test.dir/setatoms.cpp.o
1594
[ 89%] Linking CXX executable ../../../../bin/gmxpreprocess-test
1595
[ 89%] Built target gmxpreprocess-test
1596
[ 89%] Building CXX object src/gromacs/coordinateio/tests/CMakeFiles/coordinateio-test.dir/setbothtime.cpp.o
1597
Scanning dependencies of target tool-test
1598
[ 89%] Building CXX object src/gromacs/tools/tests/CMakeFiles/tool-test.dir/dump.cpp.o
1599
[ 89%] Building CXX object src/gromacs/tools/tests/CMakeFiles/tool-test.dir/report_methods.cpp.o
1600
[ 89%] Building CXX object src/gromacs/tools/tests/CMakeFiles/tool-test.dir/trjconv.cpp.o
1601
[ 89%] Building CXX object src/gromacs/tools/tests/CMakeFiles/tool-test.dir/__/__/__/testutils/unittest_main.cpp.o
1602
Scanning dependencies of target fileio-test
1603
[ 89%] Building CXX object src/gromacs/fileio/tests/CMakeFiles/fileio-test.dir/confio.cpp.o
1604
[ 89%] Linking CXX executable ../../../../bin/energyanalysis-test
1605
[ 89%] Built target energyanalysis-test
1606
[ 89%] Building CXX object src/gromacs/fileio/tests/CMakeFiles/fileio-test.dir/filemd5.cpp.o
1607
[ 89%] Building CXX object src/gromacs/fileio/tests/CMakeFiles/fileio-test.dir/mrcserializer.cpp.o
1608
[ 89%] Building CXX object src/gromacs/fileio/tests/CMakeFiles/fileio-test.dir/mrcdensitymap.cpp.o
1609
[ 89%] Building CXX object src/gromacs/coordinateio/tests/CMakeFiles/coordinateio-test.dir/setstarttime.cpp.o
1610
[ 89%] Building CXX object src/gromacs/coordinateio/tests/CMakeFiles/coordinateio-test.dir/settimestep.cpp.o
1611
[ 89%] Building CXX object src/gromacs/coordinateio/tests/CMakeFiles/coordinateio-test.dir/testmodule.cpp.o
1612
[ 90%] Linking CXX executable ../../../../bin/tool-test
1613
[ 90%] Building CXX object src/gromacs/coordinateio/tests/CMakeFiles/coordinateio-test.dir/__/__/__/testutils/unittest_main.cpp.o
1614
[ 90%] Built target tool-test
1615
[ 90%] Building CXX object src/gromacs/fileio/tests/CMakeFiles/fileio-test.dir/mrcdensitymapheader.cpp.o
1616
Scanning dependencies of target selection-test
1617
[ 90%] Building CXX object src/gromacs/selection/tests/CMakeFiles/selection-test.dir/indexutil.cpp.o
1618
[ 90%] Building CXX object src/gromacs/selection/tests/CMakeFiles/selection-test.dir/nbsearch.cpp.o
1619
[ 90%] Building CXX object src/gromacs/selection/tests/CMakeFiles/selection-test.dir/poscalc.cpp.o
1620
[ 90%] Building CXX object src/gromacs/selection/tests/CMakeFiles/selection-test.dir/selectioncollection.cpp.o
1621
[ 90%] Building CXX object src/gromacs/selection/tests/CMakeFiles/selection-test.dir/selectionoption.cpp.o
1622
[ 90%] Building CXX object src/gromacs/fileio/tests/CMakeFiles/fileio-test.dir/readinp.cpp.o
1623
[ 90%] Linking CXX executable ../../../../bin/coordinateio-test
1624
Scanning dependencies of target mdrun-test
1625
[ 90%] Building CXX object src/programs/mdrun/tests/CMakeFiles/mdrun-test.dir/compressed_x_output.cpp.o
1626
[ 90%] Built target coordinateio-test
1627
[ 90%] Building CXX object src/programs/mdrun/tests/CMakeFiles/mdrun-test.dir/densityfittingmodule.cpp.o
1628
[ 90%] Building CXX object src/programs/mdrun/tests/CMakeFiles/mdrun-test.dir/exactcontinuation.cpp.o
1629
[ 92%] Building CXX object src/programs/mdrun/tests/CMakeFiles/mdrun-test.dir/grompp.cpp.o
1630
[ 92%] Building CXX object src/programs/mdrun/tests/CMakeFiles/mdrun-test.dir/helpwriting.cpp.o
1631
[ 92%] Building CXX object src/programs/mdrun/tests/CMakeFiles/mdrun-test.dir/initialconstraints.cpp.o
1632
[ 92%] Building CXX object src/gromacs/fileio/tests/CMakeFiles/fileio-test.dir/fileioxdrserializer.cpp.o
1633
[ 92%] Building CXX object src/gromacs/selection/tests/CMakeFiles/selection-test.dir/toputils.cpp.o
1634
[ 92%] Building CXX object src/gromacs/selection/tests/CMakeFiles/selection-test.dir/__/__/__/testutils/unittest_main.cpp.o
1635
[ 92%] Building CXX object src/gromacs/fileio/tests/CMakeFiles/fileio-test.dir/tngio.cpp.o
1636
Scanning dependencies of target mdrun-mpi-test
1637
[ 92%] Building CXX object src/programs/mdrun/tests/CMakeFiles/mdrun-mpi-test.dir/domain_decomposition.cpp.o
1638
[ 92%] Building CXX object src/programs/mdrun/tests/CMakeFiles/mdrun-mpi-test.dir/minimize.cpp.o
1639
[ 92%] Building CXX object src/programs/mdrun/tests/CMakeFiles/mdrun-mpi-test.dir/mimic.cpp.o
1640
[ 92%] Building CXX object src/programs/mdrun/tests/CMakeFiles/mdrun-test.dir/interactiveMD.cpp.o
1641
[ 92%] Building CXX object src/programs/mdrun/tests/CMakeFiles/mdrun-mpi-test.dir/multisim.cpp.o
1642
[ 93%] Building CXX object src/programs/mdrun/tests/CMakeFiles/mdrun-mpi-test.dir/multisimtest.cpp.o
1643
[ 93%] Linking CXX executable ../../../../bin/selection-test
1644
[ 93%] Building CXX object src/gromacs/fileio/tests/CMakeFiles/fileio-test.dir/__/__/__/testutils/unittest_main.cpp.o
1645
[ 93%] Built target selection-test
1646
[ 93%] Building CXX object src/programs/mdrun/tests/CMakeFiles/mdrun-mpi-test.dir/pmetest.cpp.o
1647
[ 93%] Building CXX object src/programs/mdrun/tests/CMakeFiles/mdrun-mpi-test.dir/replicaexchange.cpp.o
1648
[ 93%] Building CXX object src/programs/mdrun/tests/CMakeFiles/mdrun-test.dir/outputfiles.cpp.o
1649
[ 93%] Building CXX object src/programs/mdrun/tests/CMakeFiles/mdrun-mpi-test.dir/__/__/__/testutils/unittest_main.cpp.o
1650
[ 93%] Building CXX object src/programs/mdrun/tests/CMakeFiles/mdrun-test.dir/orires.cpp.o
1651
[ 93%] Building CXX object src/programs/mdrun/tests/CMakeFiles/mdrun-test.dir/pmetest.cpp.o
1652
[ 93%] Building CXX object src/programs/mdrun/tests/CMakeFiles/mdrun-test.dir/simulator.cpp.o
1653
[ 93%] Linking CXX executable ../../../../bin/fileio-test
1654
[ 93%] Built target fileio-test
1655
[ 93%] Building CXX object src/programs/mdrun/tests/CMakeFiles/mdrun-test.dir/swapcoords.cpp.o
1656
[ 93%] Building CXX object src/programs/mdrun/tests/CMakeFiles/mdrun-test.dir/tabulated_bonded_interactions.cpp.o
1657
[ 93%] Building CXX object src/programs/mdrun/tests/CMakeFiles/mdrun-test.dir/termination.cpp.o
1658
Scanning dependencies of target mdrun-non-integrator-test
1659
[ 93%] Building CXX object src/programs/mdrun/tests/CMakeFiles/mdrun-non-integrator-test.dir/minimize.cpp.o
1660
[ 93%] Building CXX object src/programs/mdrun/tests/CMakeFiles/mdrun-non-integrator-test.dir/nonbonded_bench.cpp.o
1661
[ 93%] Linking CXX executable ../../../../bin/mdrun-mpi-test
1662
[ 93%] Built target mdrun-mpi-test
1663
[ 93%] Building CXX object src/programs/mdrun/tests/CMakeFiles/mdrun-non-integrator-test.dir/normalmodes.cpp.o
1664
[ 93%] Building CXX object src/programs/mdrun/tests/CMakeFiles/mdrun-non-integrator-test.dir/rerun.cpp.o
1665
[ 93%] Building CXX object src/programs/mdrun/tests/CMakeFiles/mdrun-non-integrator-test.dir/simple_mdrun.cpp.o
1666
Scanning dependencies of target mdrun-tpi-test
1667
[ 93%] Building CXX object src/programs/mdrun/tests/CMakeFiles/mdrun-tpi-test.dir/tpitest.cpp.o
1668
[ 93%] Building CXX object src/programs/mdrun/tests/CMakeFiles/mdrun-tpi-test.dir/__/__/__/testutils/unittest_main.cpp.o
1669
[ 93%] Building CXX object src/programs/mdrun/tests/CMakeFiles/mdrun-test.dir/trajectory_writing.cpp.o
1670
[ 93%] Building CXX object src/programs/mdrun/tests/CMakeFiles/mdrun-test.dir/mimic.cpp.o
1671
Scanning dependencies of target gmxapi-mpi-test
1672
[ 93%] Building CXX object src/api/cpp/tests/CMakeFiles/gmxapi-mpi-test.dir/restraint.cpp.o
1673
Scanning dependencies of target gmxapi-test
1674
[ 94%] Building CXX object src/api/cpp/tests/CMakeFiles/gmxapi-test.dir/restraint.cpp.o
1675
[ 94%] Building CXX object src/api/cpp/tests/CMakeFiles/gmxapi-test.dir/status.cpp.o
1676
[ 94%] Building CXX object src/api/cpp/tests/CMakeFiles/gmxapi-test.dir/system.cpp.o
1677
[ 94%] Building CXX object src/programs/mdrun/tests/CMakeFiles/mdrun-non-integrator-test.dir/__/__/__/testutils/unittest_main.cpp.o
1678
[ 94%] Linking CXX executable ../../../../bin/mdrun-tpi-test
1679
[ 94%] Built target mdrun-tpi-test
1680
[ 94%] Building CXX object src/api/cpp/tests/CMakeFiles/gmxapi-test.dir/version.cpp.o
1681
[ 94%] Building CXX object src/api/cpp/tests/CMakeFiles/gmxapi-test.dir/__/__/__/testutils/unittest_main.cpp.o
1682
[ 94%] Building CXX object src/api/cpp/tests/CMakeFiles/gmxapi-mpi-test.dir/status.cpp.o
1683
[ 94%] Building CXX object src/api/cpp/tests/CMakeFiles/gmxapi-mpi-test.dir/system.cpp.o
1684
[ 94%] Building CXX object src/programs/mdrun/tests/CMakeFiles/mdrun-test.dir/__/__/__/testutils/unittest_main.cpp.o
1685
[ 94%] Building CXX object src/api/cpp/tests/CMakeFiles/gmxapi-mpi-test.dir/version.cpp.o
1686
[ 94%] Linking CXX executable ../../../../bin/mdrun-non-integrator-test
1687
[ 94%] Built target mdrun-non-integrator-test
1688
[ 94%] Building CXX object src/api/cpp/tests/CMakeFiles/gmxapi-mpi-test.dir/__/__/__/testutils/unittest_main.cpp.o
1689
Scanning dependencies of target workflow-details-test
1690
[ 94%] Building CXX object src/api/cpp/workflow/tests/CMakeFiles/workflow-details-test.dir/workflow.cpp.o
1691
[ 94%] Building CXX object src/api/cpp/workflow/tests/CMakeFiles/workflow-details-test.dir/__/__/__/__/testutils/unittest_main.cpp.o
1692
[ 94%] Linking CXX executable ../../../../bin/gmxapi-test
1693
[ 94%] Built target gmxapi-test
1694
Scanning dependencies of target workflow-details-mpi-test
1695
[ 94%] Building CXX object src/api/cpp/workflow/tests/CMakeFiles/workflow-details-mpi-test.dir/workflow.cpp.o
1696
[ 95%] Linking CXX executable ../../../../bin/mdrun-test
1697
[ 95%] Building CXX object src/api/cpp/workflow/tests/CMakeFiles/workflow-details-mpi-test.dir/__/__/__/__/testutils/unittest_main.cpp.o
1698
[ 95%] Built target mdrun-test
1699
Scanning dependencies of target commandline-test
1700
[ 95%] Building CXX object src/gromacs/commandline/tests/CMakeFiles/commandline-test.dir/cmdlinehelpmodule.cpp.o
1701
[ 96%] Building CXX object src/gromacs/commandline/tests/CMakeFiles/commandline-test.dir/cmdlinehelpwriter.cpp.o
1702
[ 96%] Building CXX object src/gromacs/commandline/tests/CMakeFiles/commandline-test.dir/cmdlinemodulemanager.cpp.o
1703
[ 96%] Linking CXX executable ../../../../bin/gmxapi-mpi-test
1704
[ 96%] Built target gmxapi-mpi-test
1705
[ 96%] Building CXX object src/gromacs/commandline/tests/CMakeFiles/commandline-test.dir/cmdlinemodulemanagertest.cpp.o
1706
[ 96%] Building CXX object src/gromacs/commandline/tests/CMakeFiles/commandline-test.dir/cmdlineparser.cpp.o
1707
[ 97%] Linking CXX executable ../../../../../bin/workflow-details-test
1708
[ 97%] Built target workflow-details-test
1709
[ 97%] Building CXX object src/gromacs/commandline/tests/CMakeFiles/commandline-test.dir/cmdlineprogramcontext.cpp.o
1710
[ 97%] Building CXX object src/gromacs/commandline/tests/CMakeFiles/commandline-test.dir/filenm.cpp.o
1711
[ 97%] Linking CXX executable ../../../../../bin/workflow-details-mpi-test
1712
[ 97%] Built target workflow-details-mpi-test
1713
[ 97%] Building CXX object src/gromacs/commandline/tests/CMakeFiles/commandline-test.dir/pargs.cpp.o
1714
Scanning dependencies of target mdrunutility-test
1715
[ 97%] Building CXX object src/gromacs/mdrunutility/tests/CMakeFiles/mdrunutility-test.dir/threadaffinity.cpp.o
1716
[ 97%] Building CXX object src/gromacs/mdrunutility/tests/CMakeFiles/mdrunutility-test.dir/__/__/__/testutils/unittest_main.cpp.o
1717
Scanning dependencies of target mdrunutility-mpi-test
1718
[ 97%] Building CXX object src/gromacs/mdrunutility/tests/CMakeFiles/mdrunutility-mpi-test.dir/threadaffinity_mpi.cpp.o
1719
[ 98%] Building CXX object src/gromacs/mdrunutility/tests/CMakeFiles/mdrunutility-mpi-test.dir/__/__/__/testutils/unittest_main.cpp.o
1720
Scanning dependencies of target analysisdata-test
1721
[ 98%] Building CXX object src/gromacs/analysisdata/tests/CMakeFiles/analysisdata-test.dir/analysisdata.cpp.o
1722
[ 98%] Building CXX object src/gromacs/analysisdata/tests/CMakeFiles/analysisdata-test.dir/arraydata.cpp.o
1723
[ 98%] Building CXX object src/gromacs/analysisdata/tests/CMakeFiles/analysisdata-test.dir/average.cpp.o
1724
[ 98%] Building CXX object src/gromacs/analysisdata/tests/CMakeFiles/analysisdata-test.dir/histogram.cpp.o
1725
[ 98%] Building CXX object src/gromacs/commandline/tests/CMakeFiles/commandline-test.dir/__/__/__/testutils/unittest_main.cpp.o
1726
[ 98%] Linking CXX executable ../../../../bin/mdrunutility-test
1727
[ 98%] Built target mdrunutility-test
1728
[ 98%] Building CXX object src/gromacs/analysisdata/tests/CMakeFiles/analysisdata-test.dir/lifetime.cpp.o
1729
Scanning dependencies of target trajectoryanalysis-test
1730
[ 98%] Building CXX object src/gromacs/trajectoryanalysis/tests/CMakeFiles/trajectoryanalysis-test.dir/moduletest.cpp.o
1731
[ 98%] Building CXX object src/gromacs/trajectoryanalysis/tests/CMakeFiles/trajectoryanalysis-test.dir/clustsize.cpp.o
1732
[ 98%] Building CXX object src/gromacs/trajectoryanalysis/tests/CMakeFiles/trajectoryanalysis-test.dir/cmdlinerunner.cpp.o
1733
[ 98%] Linking CXX executable ../../../../bin/mdrunutility-mpi-test
1734
[ 98%] Built target mdrunutility-mpi-test
1735
[ 98%] Building CXX object src/gromacs/trajectoryanalysis/tests/CMakeFiles/trajectoryanalysis-test.dir/angle.cpp.o
1736
[ 98%] Building CXX object src/gromacs/trajectoryanalysis/tests/CMakeFiles/trajectoryanalysis-test.dir/convert_trj.cpp.o
1737
[ 98%] Linking CXX executable ../../../../bin/commandline-test
1738
[ 98%] Built target commandline-test
1739
[ 98%] Building CXX object src/gromacs/trajectoryanalysis/tests/CMakeFiles/trajectoryanalysis-test.dir/distance.cpp.o
1740
[ 98%] Building CXX object src/gromacs/trajectoryanalysis/tests/CMakeFiles/trajectoryanalysis-test.dir/extract_cluster.cpp.o
1741
[ 98%] Building CXX object src/gromacs/analysisdata/tests/CMakeFiles/analysisdata-test.dir/__/__/__/testutils/unittest_main.cpp.o
1742
[ 98%] Building CXX object src/gromacs/trajectoryanalysis/tests/CMakeFiles/trajectoryanalysis-test.dir/freevolume.cpp.o
1743
[100%] Building CXX object src/gromacs/trajectoryanalysis/tests/CMakeFiles/trajectoryanalysis-test.dir/pairdist.cpp.o
1744
[100%] Building CXX object src/gromacs/trajectoryanalysis/tests/CMakeFiles/trajectoryanalysis-test.dir/rdf.cpp.o
1745
[100%] Building CXX object src/gromacs/trajectoryanalysis/tests/CMakeFiles/trajectoryanalysis-test.dir/sasa.cpp.o
1746
[100%] Linking CXX executable ../../../../bin/analysisdata-test
1747
[100%] Built target analysisdata-test
1748
[100%] Building CXX object src/gromacs/trajectoryanalysis/tests/CMakeFiles/trajectoryanalysis-test.dir/select.cpp.o
1749
[100%] Building CXX object src/gromacs/trajectoryanalysis/tests/CMakeFiles/trajectoryanalysis-test.dir/surfacearea.cpp.o
1750
[100%] Building CXX object src/gromacs/trajectoryanalysis/tests/CMakeFiles/trajectoryanalysis-test.dir/topologyinformation.cpp.o
1751
[100%] Building CXX object src/gromacs/trajectoryanalysis/tests/CMakeFiles/trajectoryanalysis-test.dir/trajectory.cpp.o
1752
[100%] Building CXX object src/gromacs/trajectoryanalysis/tests/CMakeFiles/trajectoryanalysis-test.dir/unionfind.cpp.o
1753
[100%] Building CXX object src/gromacs/trajectoryanalysis/tests/CMakeFiles/trajectoryanalysis-test.dir/__/__/__/testutils/unittest_main.cpp.o
1754
[100%] Linking CXX executable ../../../../bin/trajectoryanalysis-test
1755
[100%] Built target trajectoryanalysis-test
1756
Scanning dependencies of target tests
1757
[100%] Built target tests
1758
+ /opt/cmake/3.14.5/bin/ctest -D ExperimentalTest --output-on-failure --label-exclude SlowTest
1759
   Site: bs-gpu01
1760
   Build name: Linux-clang++-8
1761
Create new tag: 20200228-1756 - Experimental
1762
Test project /mnt/workspace/Matrix_OnDemand/80361d7e/gromacs
1763
      Start  1: TestUtilsUnitTests
1764
 1/50 Test  #1: TestUtilsUnitTests ...............   Passed    0.03 sec
1765
      Start  2: TestUtilsMpiUnitTests
1766
 2/50 Test  #2: TestUtilsMpiUnitTests ............   Passed    0.02 sec
1767
      Start  3: UtilityUnitTests
1768
 3/50 Test  #3: UtilityUnitTests .................   Passed    0.04 sec
1769
      Start  4: UtilityMpiUnitTests
1770
 4/50 Test  #4: UtilityMpiUnitTests ..............   Passed    0.02 sec
1771
      Start  5: MdlibUnitTest
1772
 5/50 Test  #5: MdlibUnitTest ....................   Passed    0.45 sec
1773
      Start  6: AppliedForcesUnitTest
1774
 6/50 Test  #6: AppliedForcesUnitTest ............   Passed    0.02 sec
1775
      Start  7: ListedForcesTest
1776
 7/50 Test  #7: ListedForcesTest .................   Passed    0.12 sec
1777
      Start  8: CommandLineUnitTests
1778
 8/50 Test  #8: CommandLineUnitTests .............   Passed    0.03 sec
1779
      Start  9: DomDecTests
1780
 9/50 Test  #9: DomDecTests ......................   Passed    0.02 sec
1781
      Start 10: EwaldUnitTests
1782
10/50 Test #10: EwaldUnitTests ...................   Passed    3.99 sec
1783
      Start 11: FFTUnitTests
1784
11/50 Test #11: FFTUnitTests .....................   Passed    0.07 sec
1785
      Start 12: GpuUtilsUnitTests
1786
12/50 Test #12: GpuUtilsUnitTests ................   Passed    1.19 sec
1787
      Start 13: HardwareUnitTests
1788
13/50 Test #13: HardwareUnitTests ................   Passed    0.35 sec
1789
      Start 14: MathUnitTests
1790
14/50 Test #14: MathUnitTests ....................   Passed    0.12 sec
1791
      Start 15: MdrunUtilityUnitTests
1792
15/50 Test #15: MdrunUtilityUnitTests ............   Passed    0.04 sec
1793
      Start 16: MdrunUtilityMpiUnitTests
1794
16/50 Test #16: MdrunUtilityMpiUnitTests .........   Passed    0.04 sec
1795
      Start 17: MDSpanTests
1796
17/50 Test #17: MDSpanTests ......................   Passed    0.02 sec
1797
      Start 18: OnlineHelpUnitTests
1798
18/50 Test #18: OnlineHelpUnitTests ..............   Passed    0.02 sec
1799
      Start 19: OptionsUnitTests
1800
19/50 Test #19: OptionsUnitTests .................   Passed    0.03 sec
1801
      Start 20: PbcutilUnitTest
1802
20/50 Test #20: PbcutilUnitTest ..................   Passed    0.02 sec
1803
      Start 21: RandomUnitTests
1804
21/50 Test #21: RandomUnitTests ..................   Passed    0.05 sec
1805
      Start 22: RestraintTests
1806
22/50 Test #22: RestraintTests ...................   Passed    0.02 sec
1807
      Start 23: TableUnitTests
1808
23/50 Test #23: TableUnitTests ...................   Passed    0.27 sec
1809
      Start 24: TaskAssignmentUnitTests
1810
24/50 Test #24: TaskAssignmentUnitTests ..........   Passed    0.02 sec
1811
      Start 25: TopologyTest
1812
25/50 Test #25: TopologyTest .....................   Passed    0.02 sec
1813
      Start 26: PullTest
1814
26/50 Test #26: PullTest .........................   Passed    0.01 sec
1815
      Start 27: AwhTest
1816
27/50 Test #27: AwhTest ..........................   Passed    0.03 sec
1817
      Start 28: SimdUnitTests
1818
28/50 Test #28: SimdUnitTests ....................   Passed    0.12 sec
1819
      Start 29: CompatibilityHelpersTests
1820
29/50 Test #29: CompatibilityHelpersTests ........   Passed    0.02 sec
1821
      Start 30: GmxAnaTest
1822
30/50 Test #30: GmxAnaTest .......................   Passed    4.05 sec
1823
      Start 31: GmxPreprocessTests
1824
31/50 Test #31: GmxPreprocessTests ...............   Passed    3.40 sec
1825
      Start 32: Pdb2gmx1Test
1826
32/50 Test #32: Pdb2gmx1Test .....................   Passed    2.65 sec
1827
      Start 33: Pdb2gmx2Test
1828
33/50 Test #33: Pdb2gmx2Test .....................   Passed    2.24 sec
1829
      Start 34: Pdb2gmx3Test
1830
34/50 Test #34: Pdb2gmx3Test .....................   Passed    2.47 sec
1831
      Start 35: CorrelationsTest
1832
35/50 Test #35: CorrelationsTest .................   Passed    0.49 sec
1833
      Start 36: AnalysisDataUnitTests
1834
36/50 Test #36: AnalysisDataUnitTests ............   Passed    0.06 sec
1835
      Start 37: CoordinateIOTests
1836
37/50 Test #37: CoordinateIOTests ................   Passed    0.25 sec
1837
      Start 38: TrajectoryAnalysisUnitTests
1838
38/50 Test #38: TrajectoryAnalysisUnitTests ......   Passed    2.77 sec
1839
      Start 39: EnergyAnalysisUnitTests
1840
39/50 Test #39: EnergyAnalysisUnitTests ..........   Passed    0.15 sec
1841
      Start 40: ToolUnitTests
1842
40/50 Test #40: ToolUnitTests ....................   Passed    3.07 sec
1843
      Start 41: FileIOTests
1844
41/50 Test #41: FileIOTests ......................   Passed    0.03 sec
1845
      Start 42: SelectionUnitTests
1846
42/50 Test #42: SelectionUnitTests ...............   Passed    0.42 sec
1847
      Start 43: MdrunTests
1848
43/50 Test #43: MdrunTests .......................   Passed  106.03 sec
1849
      Start 44: MdrunNonIntegratorTests
1850
44/50 Test #44: MdrunNonIntegratorTests ..........   Passed   18.81 sec
1851
      Start 45: MdrunTpiTests
1852
45/50 Test #45: MdrunTpiTests ....................   Passed    3.39 sec
1853
      Start 46: MdrunMpiTests
1854
46/50 Test #46: MdrunMpiTests ....................   Passed   86.32 sec
1855
      Start 47: GmxapiExternalInterfaceTests
1856
47/50 Test #47: GmxapiExternalInterfaceTests .....   Passed    4.16 sec
1857
      Start 48: GmxapiMpiTests
1858
48/50 Test #48: GmxapiMpiTests ...................   Passed    4.30 sec
1859
      Start 49: GmxapiInternalInterfaceTests
1860
49/50 Test #49: GmxapiInternalInterfaceTests .....   Passed    2.69 sec
1861
      Start 50: GmxapiInternalsMpiTests
1862
50/50 Test #50: GmxapiInternalsMpiTests ..........   Passed    2.71 sec
1863

    
1864
100% tests passed, 0 tests failed out of 50
1865

    
1866
Label Time Summary:
1867
GTest              = 257.63 sec*proc (50 tests)
1868
IntegrationTest    = 232.45 sec*proc (9 tests)
1869
MpiTest            =  93.41 sec*proc (6 tests)
1870
UnitTest           =  25.17 sec*proc (41 tests)
1871

    
1872
Total Test time (real) = 257.69 sec
1873
+ /opt/cmake/3.14.5/bin/cmake --build . --target install -- -j8
1874
[  0%] Generating git version information
1875
[  0%] Built target lmfit_objlib
1876
[  0%] Built target tng_io_zlib
1877
[  0%] Built target linearalgebra
1878
[  3%] Built target tng_io_obj
1879
[  4%] Built target clFFT
1880
[  4%] Built target vmddlopen
1881
[  4%] Built target view_objlib
1882
[  6%] Built target scanner
1883
[  8%] Built target modularsimulator
1884
[  8%] Built target mdrun_objlib
1885
[ 11%] Built target thread_mpi
1886
[ 11%] Built target git-version-info
1887
[ 96%] Built target libgromacs
1888
[ 96%] Built target template
1889
[ 96%] Built target gmx
1890
[ 98%] Built target gmxapi
1891
[100%] Built target completion
1892
Install the project...
1893
-- Install configuration: "Debug"
1894
-- Installing: /home/jenkins/workspace/Matrix_OnDemand/80361d7e/test-install/share/gromacs/COPYING
1895
-- Installing: /home/jenkins/workspace/Matrix_OnDemand/80361d7e/test-install/share/gromacs/README.tutor
1896
-- Installing: /home/jenkins/workspace/Matrix_OnDemand/80361d7e/test-install/share/gromacs/README_FreeEnergyModifications.txt
1897
-- Installing: /home/jenkins/workspace/Matrix_OnDemand/80361d7e/test-install/share/gromacs/top
1898
-- Installing: /home/jenkins/workspace/Matrix_OnDemand/80361d7e/test-install/share/gromacs/top/tip4p.itp
1899
-- Installing: /home/jenkins/workspace/Matrix_OnDemand/80361d7e/test-install/share/gromacs/top/spc216.gro
1900
-- Installing: /home/jenkins/workspace/Matrix_OnDemand/80361d7e/test-install/share/gromacs/top/ps.m2p
1901
-- Installing: /home/jenkins/workspace/Matrix_OnDemand/80361d7e/test-install/share/gromacs/top/cb-shift.dat
1902
-- Installing: /home/jenkins/workspace/Matrix_OnDemand/80361d7e/test-install/share/gromacs/top/ffoplsaa.itp
1903
-- Installing: /home/jenkins/workspace/Matrix_OnDemand/80361d7e/test-install/share/gromacs/top/random.dat
1904
-- Installing: /home/jenkins/workspace/Matrix_OnDemand/80361d7e/test-install/share/gromacs/top/tip3p.itp
1905
-- Installing: /home/jenkins/workspace/Matrix_OnDemand/80361d7e/test-install/share/gromacs/top/bonds.dlg
1906
-- Installing: /home/jenkins/workspace/Matrix_OnDemand/80361d7e/test-install/share/gromacs/top/residues.xml
1907
-- Installing: /home/jenkins/workspace/Matrix_OnDemand/80361d7e/test-install/share/gromacs/top/export.dlg
1908
-- Installing: /home/jenkins/workspace/Matrix_OnDemand/80361d7e/test-install/share/gromacs/top/spce.itp
1909
-- Installing: /home/jenkins/workspace/Matrix_OnDemand/80361d7e/test-install/share/gromacs/top/sw.itp
1910
-- Installing: /home/jenkins/workspace/Matrix_OnDemand/80361d7e/test-install/share/gromacs/top/vdwradii.dat
1911
-- Installing: /home/jenkins/workspace/Matrix_OnDemand/80361d7e/test-install/share/gromacs/top/amberGS.ff
1912
-- Installing: /home/jenkins/workspace/Matrix_OnDemand/80361d7e/test-install/share/gromacs/top/amberGS.ff/aminoacids.arn
1913
-- Installing: /home/jenkins/workspace/Matrix_OnDemand/80361d7e/test-install/share/gromacs/top/amberGS.ff/tip4p.itp
1914
-- Installing: /home/jenkins/workspace/Matrix_OnDemand/80361d7e/test-install/share/gromacs/top/amberGS.ff/ffnonbonded.itp
1915
-- Installing: /home/jenkins/workspace/Matrix_OnDemand/80361d7e/test-install/share/gromacs/top/amberGS.ff/tip5p.itp
1916
-- Installing: /home/jenkins/workspace/Matrix_OnDemand/80361d7e/test-install/share/gromacs/top/amberGS.ff/tip3p.itp
1917
-- Installing: /home/jenkins/workspace/Matrix_OnDemand/80361d7e/test-install/share/gromacs/top/amberGS.ff/aminoacids.r2b
1918
-- Installing: /home/jenkins/workspace/Matrix_OnDemand/80361d7e/test-install/share/gromacs/top/amberGS.ff/aminoacids.hdb
1919
-- Installing: /home/jenkins/workspace/Matrix_OnDemand/80361d7e/test-install/share/gromacs/top/amberGS.ff/aminoacids.vsd
1920
-- Installing: /home/jenkins/workspace/Matrix_OnDemand/80361d7e/test-install/share/gromacs/top/amberGS.ff/rna.rtp
1921
-- Installing: /home/jenkins/workspace/Matrix_OnDemand/80361d7e/test-install/share/gromacs/top/amberGS.ff/dna.arn
1922
-- Installing: /home/jenkins/workspace/Matrix_OnDemand/80361d7e/test-install/share/gromacs/top/amberGS.ff/spce.itp
1923
-- Installing: /home/jenkins/workspace/Matrix_OnDemand/80361d7e/test-install/share/gromacs/top/amberGS.ff/rna.arn
1924
-- Installing: /home/jenkins/workspace/Matrix_OnDemand/80361d7e/test-install/share/gromacs/top/amberGS.ff/aminoacids.n.tdb
1925
-- Installing: /home/jenkins/workspace/Matrix_OnDemand/80361d7e/test-install/share/gromacs/top/amberGS.ff/urea.itp
1926
-- Installing: /home/jenkins/workspace/Matrix_OnDemand/80361d7e/test-install/share/gromacs/top/amberGS.ff/aminoacids.c.tdb
1927
-- Installing: /home/jenkins/workspace/Matrix_OnDemand/80361d7e/test-install/share/gromacs/top/amberGS.ff/dna.rtp
1928
-- Installing: /home/jenkins/workspace/Matrix_OnDemand/80361d7e/test-install/share/gromacs/top/amberGS.ff/ffbonded.itp
1929
-- Installing: /home/jenkins/workspace/Matrix_OnDemand/80361d7e/test-install/share/gromacs/top/amberGS.ff/aminoacids.rtp
1930
-- Installing: /home/jenkins/workspace/Matrix_OnDemand/80361d7e/test-install/share/gromacs/top/amberGS.ff/rna.r2b
1931
-- Installing: /home/jenkins/workspace/Matrix_OnDemand/80361d7e/test-install/share/gromacs/top/amberGS.ff/watermodels.dat
1932
-- Installing: /home/jenkins/workspace/Matrix_OnDemand/80361d7e/test-install/share/gromacs/top/amberGS.ff/dna.hdb
1933
-- Installing: /home/jenkins/workspace/Matrix_OnDemand/80361d7e/test-install/share/gromacs/top/amberGS.ff/ions.itp
1934
-- Installing: /home/jenkins/workspace/Matrix_OnDemand/80361d7e/test-install/share/gromacs/top/amberGS.ff/spc.itp
1935
-- Installing: /home/jenkins/workspace/Matrix_OnDemand/80361d7e/test-install/share/gromacs/top/amberGS.ff/rna.hdb
1936
-- Installing: /home/jenkins/workspace/Matrix_OnDemand/80361d7e/test-install/share/gromacs/top/amberGS.ff/dna.r2b
1937
-- Installing: /home/jenkins/workspace/Matrix_OnDemand/80361d7e/test-install/share/gromacs/top/amberGS.ff/forcefield.itp
1938
-- Installing: /home/jenkins/workspace/Matrix_OnDemand/80361d7e/test-install/share/gromacs/top/amberGS.ff/atomtypes.atp
1939
-- Installing: /home/jenkins/workspace/Matrix_OnDemand/80361d7e/test-install/share/gromacs/top/amberGS.ff/forcefield.doc
1940
-- Installing: /home/jenkins/workspace/Matrix_OnDemand/80361d7e/test-install/share/gromacs/top/amberGS.ff/tip4pew.itp
1941
-- Installing: /home/jenkins/workspace/Matrix_OnDemand/80361d7e/test-install/share/gromacs/top/amber99.ff
1942
-- Installing: /home/jenkins/workspace/Matrix_OnDemand/80361d7e/test-install/share/gromacs/top/amber99.ff/aminoacids.arn
1943
-- Installing: /home/jenkins/workspace/Matrix_OnDemand/80361d7e/test-install/share/gromacs/top/amber99.ff/tip4p.itp
1944
-- Installing: /home/jenkins/workspace/Matrix_OnDemand/80361d7e/test-install/share/gromacs/top/amber99.ff/ffnonbonded.itp
1945
-- Installing: /home/jenkins/workspace/Matrix_OnDemand/80361d7e/test-install/share/gromacs/top/amber99.ff/tip5p.itp
1946
-- Installing: /home/jenkins/workspace/Matrix_OnDemand/80361d7e/test-install/share/gromacs/top/amber99.ff/tip3p.itp
1947
-- Installing: /home/jenkins/workspace/Matrix_OnDemand/80361d7e/test-install/share/gromacs/top/amber99.ff/aminoacids.r2b
1948
-- Installing: /home/jenkins/workspace/Matrix_OnDemand/80361d7e/test-install/share/gromacs/top/amber99.ff/aminoacids.hdb
1949
-- Installing: /home/jenkins/workspace/Matrix_OnDemand/80361d7e/test-install/share/gromacs/top/amber99.ff/aminoacids.vsd
1950
-- Installing: /home/jenkins/workspace/Matrix_OnDemand/80361d7e/test-install/share/gromacs/top/amber99.ff/rna.rtp
1951
-- Installing: /home/jenkins/workspace/Matrix_OnDemand/80361d7e/test-install/share/gromacs/top/amber99.ff/dna.arn
1952
-- Installing: /home/jenkins/workspace/Matrix_OnDemand/80361d7e/test-install/share/gromacs/top/amber99.ff/spce.itp
1953
-- Installing: /home/jenkins/workspace/Matrix_OnDemand/80361d7e/test-install/share/gromacs/top/amber99.ff/rna.arn
1954
-- Installing: /home/jenkins/workspace/Matrix_OnDemand/80361d7e/test-install/share/gromacs/top/amber99.ff/aminoacids.n.tdb
1955
-- Installing: /home/jenkins/workspace/Matrix_OnDemand/80361d7e/test-install/share/gromacs/top/amber99.ff/urea.itp
1956
-- Installing: /home/jenkins/workspace/Matrix_OnDemand/80361d7e/test-install/share/gromacs/top/amber99.ff/aminoacids.c.tdb
1957
-- Installing: /home/jenkins/workspace/Matrix_OnDemand/80361d7e/test-install/share/gromacs/top/amber99.ff/dna.rtp
1958
-- Installing: /home/jenkins/workspace/Matrix_OnDemand/80361d7e/test-install/share/gromacs/top/amber99.ff/ffbonded.itp
1959
-- Installing: /home/jenkins/workspace/Matrix_OnDemand/80361d7e/test-install/share/gromacs/top/amber99.ff/aminoacids.rtp
1960
-- Installing: /home/jenkins/workspace/Matrix_OnDemand/80361d7e/test-install/share/gromacs/top/amber99.ff/rna.r2b
1961
-- Installing: /home/jenkins/workspace/Matrix_OnDemand/80361d7e/test-install/share/gromacs/top/amber99.ff/watermodels.dat
1962
-- Installing: /home/jenkins/workspace/Matrix_OnDemand/80361d7e/test-install/share/gromacs/top/amber99.ff/dna.hdb
1963
-- Installing: /home/jenkins/workspace/Matrix_OnDemand/80361d7e/test-install/share/gromacs/top/amber99.ff/ions.itp
1964
-- Installing: /home/jenkins/workspace/Matrix_OnDemand/80361d7e/test-install/share/gromacs/top/amber99.ff/spc.itp
1965
-- Installing: /home/jenkins/workspace/Matrix_OnDemand/80361d7e/test-install/share/gromacs/top/amber99.ff/rna.hdb
1966
-- Installing: /home/jenkins/workspace/Matrix_OnDemand/80361d7e/test-install/share/gromacs/top/amber99.ff/dna.r2b
1967
-- Installing: /home/jenkins/workspace/Matrix_OnDemand/80361d7e/test-install/share/gromacs/top/amber99.ff/forcefield.itp
1968
-- Installing: /home/jenkins/workspace/Matrix_OnDemand/80361d7e/test-install/share/gromacs/top/amber99.ff/atomtypes.atp
1969
-- Installing: /home/jenkins/workspace/Matrix_OnDemand/80361d7e/test-install/share/gromacs/top/amber99.ff/forcefield.doc
1970
-- Installing: /home/jenkins/workspace/Matrix_OnDemand/80361d7e/test-install/share/gromacs/top/amber99.ff/tip4pew.itp
1971
-- Installing: /home/jenkins/workspace/Matrix_OnDemand/80361d7e/test-install/share/gromacs/top/amber99sb.ff
1972
-- Installing: /home/jenkins/workspace/Matrix_OnDemand/80361d7e/test-install/share/gromacs/top/amber99sb.ff/aminoacids.arn
1973
-- Installing: /home/jenkins/workspace/Matrix_OnDemand/80361d7e/test-install/share/gromacs/top/amber99sb.ff/tip4p.itp
1974
-- Installing: /home/jenkins/workspace/Matrix_OnDemand/80361d7e/test-install/share/gromacs/top/amber99sb.ff/ffnonbonded.itp
1975
-- Installing: /home/jenkins/workspace/Matrix_OnDemand/80361d7e/test-install/share/gromacs/top/amber99sb.ff/tip5p.itp
1976
-- Installing: /home/jenkins/workspace/Matrix_OnDemand/80361d7e/test-install/share/gromacs/top/amber99sb.ff/tip3p.itp
1977
-- Installing: /home/jenkins/workspace/Matrix_OnDemand/80361d7e/test-install/share/gromacs/top/amber99sb.ff/aminoacids.r2b
1978
-- Installing: /home/jenkins/workspace/Matrix_OnDemand/80361d7e/test-install/share/gromacs/top/amber99sb.ff/aminoacids.hdb
1979
-- Installing: /home/jenkins/workspace/Matrix_OnDemand/80361d7e/test-install/share/gromacs/top/amber99sb.ff/aminoacids.vsd
1980
-- Installing: /home/jenkins/workspace/Matrix_OnDemand/80361d7e/test-install/share/gromacs/top/amber99sb.ff/rna.rtp
1981
-- Installing: /home/jenkins/workspace/Matrix_OnDemand/80361d7e/test-install/share/gromacs/top/amber99sb.ff/dna.arn
1982
-- Installing: /home/jenkins/workspace/Matrix_OnDemand/80361d7e/test-install/share/gromacs/top/amber99sb.ff/spce.itp
1983
-- Installing: /home/jenkins/workspace/Matrix_OnDemand/80361d7e/test-install/share/gromacs/top/amber99sb.ff/rna.arn
1984
-- Installing: /home/jenkins/workspace/Matrix_OnDemand/80361d7e/test-install/share/gromacs/top/amber99sb.ff/aminoacids.n.tdb
1985
-- Installing: /home/jenkins/workspace/Matrix_OnDemand/80361d7e/test-install/share/gromacs/top/amber99sb.ff/urea.itp
1986
-- Installing: /home/jenkins/workspace/Matrix_OnDemand/80361d7e/test-install/share/gromacs/top/amber99sb.ff/aminoacids.c.tdb
1987
-- Installing: /home/jenkins/workspace/Matrix_OnDemand/80361d7e/test-install/share/gromacs/top/amber99sb.ff/dna.rtp
1988
-- Installing: /home/jenkins/workspace/Matrix_OnDemand/80361d7e/test-install/share/gromacs/top/amber99sb.ff/ffbonded.itp
1989
-- Installing: /home/jenkins/workspace/Matrix_OnDemand/80361d7e/test-install/share/gromacs/top/amber99sb.ff/aminoacids.rtp
1990
-- Installing: /home/jenkins/workspace/Matrix_OnDemand/80361d7e/test-install/share/gromacs/top/amber99sb.ff/rna.r2b
1991
-- Installing: /home/jenkins/workspace/Matrix_OnDemand/80361d7e/test-install/share/gromacs/top/amber99sb.ff/watermodels.dat
1992
-- Installing: /home/jenkins/workspace/Matrix_OnDemand/80361d7e/test-install/share/gromacs/top/amber99sb.ff/dna.hdb
1993
-- Installing: /home/jenkins/workspace/Matrix_OnDemand/80361d7e/test-install/share/gromacs/top/amber99sb.ff/ions.itp
1994
-- Installing: /home/jenkins/workspace/Matrix_OnDemand/80361d7e/test-install/share/gromacs/top/amber99sb.ff/spc.itp
1995
-- Installing: /home/jenkins/workspace/Matrix_OnDemand/80361d7e/test-install/share/gromacs/top/amber99sb.ff/rna.hdb
1996
-- Installing: /home/jenkins/workspace/Matrix_OnDemand/80361d7e/test-install/share/gromacs/top/amber99sb.ff/dna.r2b
1997
-- Installing: /home/jenkins/workspace/Matrix_OnDemand/80361d7e/test-install/share/gromacs/top/amber99sb.ff/forcefield.itp
1998
-- Installing: /home/jenkins/workspace/Matrix_OnDemand/80361d7e/test-install/share/gromacs/top/amber99sb.ff/atomtypes.atp
1999
-- Installing: /home/jenkins/workspace/Matrix_OnDemand/80361d7e/test-install/share/gromacs/top/amber99sb.ff/forcefield.doc
2000
-- Installing: /home/jenkins/workspace/Matrix_OnDemand/80361d7e/test-install/share/gromacs/top/amber99sb.ff/tip4pew.itp
2001
-- Installing: /home/jenkins/workspace/Matrix_OnDemand/80361d7e/test-install/share/gromacs/top/amber94.ff
2002
-- Installing: /home/jenkins/workspace/Matrix_OnDemand/80361d7e/test-install/share/gromacs/top/amber94.ff/aminoacids.arn
2003
-- Installing: /home/jenkins/workspace/Matrix_OnDemand/80361d7e/test-install/share/gromacs/top/amber94.ff/tip4p.itp
2004
-- Installing: /home/jenkins/workspace/Matrix_OnDemand/80361d7e/test-install/share/gromacs/top/amber94.ff/ffnonbonded.itp
2005
-- Installing: /home/jenkins/workspace/Matrix_OnDemand/80361d7e/test-install/share/gromacs/top/amber94.ff/tip5p.itp
2006
-- Installing: /home/jenkins/workspace/Matrix_OnDemand/80361d7e/test-install/share/gromacs/top/amber94.ff/tip3p.itp
2007
-- Installing: /home/jenkins/workspace/Matrix_OnDemand/80361d7e/test-install/share/gromacs/top/amber94.ff/aminoacids.r2b
2008
-- Installing: /home/jenkins/workspace/Matrix_OnDemand/80361d7e/test-install/share/gromacs/top/amber94.ff/aminoacids.hdb
2009
-- Installing: /home/jenkins/workspace/Matrix_OnDemand/80361d7e/test-install/share/gromacs/top/amber94.ff/aminoacids.vsd
2010
-- Installing: /home/jenkins/workspace/Matrix_OnDemand/80361d7e/test-install/share/gromacs/top/amber94.ff/rna.rtp
2011
-- Installing: /home/jenkins/workspace/Matrix_OnDemand/80361d7e/test-install/share/gromacs/top/amber94.ff/dna.arn
2012
-- Installing: /home/jenkins/workspace/Matrix_OnDemand/80361d7e/test-install/share/gromacs/top/amber94.ff/spce.itp
2013
-- Installing: /home/jenkins/workspace/Matrix_OnDemand/80361d7e/test-install/share/gromacs/top/amber94.ff/rna.arn
2014
-- Installing: /home/jenkins/workspace/Matrix_OnDemand/80361d7e/test-install/share/gromacs/top/amber94.ff/aminoacids.n.tdb
2015
-- Installing: /home/jenkins/workspace/Matrix_OnDemand/80361d7e/test-install/share/gromacs/top/amber94.ff/urea.itp
2016
-- Installing: /home/jenkins/workspace/Matrix_OnDemand/80361d7e/test-install/share/gromacs/top/amber94.ff/aminoacids.c.tdb
2017
-- Installing: /home/jenkins/workspace/Matrix_OnDemand/80361d7e/test-install/share/gromacs/top/amber94.ff/dna.rtp
2018
-- Installing: /home/jenkins/workspace/Matrix_OnDemand/80361d7e/test-install/share/gromacs/top/amber94.ff/ffbonded.itp
2019
-- Installing: /home/jenkins/workspace/Matrix_OnDemand/80361d7e/test-install/share/gromacs/top/amber94.ff/aminoacids.rtp
2020
-- Installing: /home/jenkins/workspace/Matrix_OnDemand/80361d7e/test-install/share/gromacs/top/amber94.ff/rna.r2b
2021
-- Installing: /home/jenkins/workspace/Matrix_OnDemand/80361d7e/test-install/share/gromacs/top/amber94.ff/watermodels.dat
2022
-- Installing: /home/jenkins/workspace/Matrix_OnDemand/80361d7e/test-install/share/gromacs/top/amber94.ff/dna.hdb
2023
-- Installing: /home/jenkins/workspace/Matrix_OnDemand/80361d7e/test-install/share/gromacs/top/amber94.ff/ions.itp
2024
-- Installing: /home/jenkins/workspace/Matrix_OnDemand/80361d7e/test-install/share/gromacs/top/amber94.ff/spc.itp
2025
-- Installing: /home/jenkins/workspace/Matrix_OnDemand/80361d7e/test-install/share/gromacs/top/amber94.ff/rna.hdb
2026
-- Installing: /home/jenkins/workspace/Matrix_OnDemand/80361d7e/test-install/share/gromacs/top/amber94.ff/dna.r2b
2027
-- Installing: /home/jenkins/workspace/Matrix_OnDemand/80361d7e/test-install/share/gromacs/top/amber94.ff/forcefield.itp
2028
-- Installing: /home/jenkins/workspace/Matrix_OnDemand/80361d7e/test-install/share/gromacs/top/amber94.ff/atomtypes.atp
2029
-- Installing: /home/jenkins/workspace/Matrix_OnDemand/80361d7e/test-install/share/gromacs/top/amber94.ff/forcefield.doc
2030
-- Installing: /home/jenkins/workspace/Matrix_OnDemand/80361d7e/test-install/share/gromacs/top/amber94.ff/tip4pew.itp
2031
-- Installing: /home/jenkins/workspace/Matrix_OnDemand/80361d7e/test-install/share/gromacs/top/oplsaa.ff
2032
-- Installing: /home/jenkins/workspace/Matrix_OnDemand/80361d7e/test-install/share/gromacs/top/oplsaa.ff/tip4p.itp
2033
-- Installing: /home/jenkins/workspace/Matrix_OnDemand/80361d7e/test-install/share/gromacs/top/oplsaa.ff/ffnonbonded.itp
2034
-- Installing: /home/jenkins/workspace/Matrix_OnDemand/80361d7e/test-install/share/gromacs/top/oplsaa.ff/tip5p.itp
2035
-- Installing: /home/jenkins/workspace/Matrix_OnDemand/80361d7e/test-install/share/gromacs/top/oplsaa.ff/tip3p.itp
2036
-- Installing: /home/jenkins/workspace/Matrix_OnDemand/80361d7e/test-install/share/gromacs/top/oplsaa.ff/aminoacids.r2b
2037
-- Installing: /home/jenkins/workspace/Matrix_OnDemand/80361d7e/test-install/share/gromacs/top/oplsaa.ff/aminoacids.hdb
2038
-- Installing: /home/jenkins/workspace/Matrix_OnDemand/80361d7e/test-install/share/gromacs/top/oplsaa.ff/tip5pe.itp
2039
-- Installing: /home/jenkins/workspace/Matrix_OnDemand/80361d7e/test-install/share/gromacs/top/oplsaa.ff/ethanol.itp
2040
-- Installing: /home/jenkins/workspace/Matrix_OnDemand/80361d7e/test-install/share/gromacs/top/oplsaa.ff/aminoacids.vsd
2041
-- Installing: /home/jenkins/workspace/Matrix_OnDemand/80361d7e/test-install/share/gromacs/top/oplsaa.ff/methanol.itp
2042
-- Installing: /home/jenkins/workspace/Matrix_OnDemand/80361d7e/test-install/share/gromacs/top/oplsaa.ff/spce.itp
2043
-- Installing: /home/jenkins/workspace/Matrix_OnDemand/80361d7e/test-install/share/gromacs/top/oplsaa.ff/aminoacids.n.tdb
2044
-- Installing: /home/jenkins/workspace/Matrix_OnDemand/80361d7e/test-install/share/gromacs/top/oplsaa.ff/aminoacids.c.tdb
2045
-- Installing: /home/jenkins/workspace/Matrix_OnDemand/80361d7e/test-install/share/gromacs/top/oplsaa.ff/ffbonded.itp
2046
-- Installing: /home/jenkins/workspace/Matrix_OnDemand/80361d7e/test-install/share/gromacs/top/oplsaa.ff/aminoacids.rtp
2047
-- Installing: /home/jenkins/workspace/Matrix_OnDemand/80361d7e/test-install/share/gromacs/top/oplsaa.ff/atomname2type.n2t
2048
-- Installing: /home/jenkins/workspace/Matrix_OnDemand/80361d7e/test-install/share/gromacs/top/oplsaa.ff/watermodels.dat
2049
-- Installing: /home/jenkins/workspace/Matrix_OnDemand/80361d7e/test-install/share/gromacs/top/oplsaa.ff/ions.itp
2050
-- Installing: /home/jenkins/workspace/Matrix_OnDemand/80361d7e/test-install/share/gromacs/top/oplsaa.ff/spc.itp
2051
-- Installing: /home/jenkins/workspace/Matrix_OnDemand/80361d7e/test-install/share/gromacs/top/oplsaa.ff/forcefield.itp
2052
-- Installing: /home/jenkins/workspace/Matrix_OnDemand/80361d7e/test-install/share/gromacs/top/oplsaa.ff/atomtypes.atp
2053
-- Installing: /home/jenkins/workspace/Matrix_OnDemand/80361d7e/test-install/share/gromacs/top/oplsaa.ff/1propanol.itp
2054
-- Installing: /home/jenkins/workspace/Matrix_OnDemand/80361d7e/test-install/share/gromacs/top/oplsaa.ff/forcefield.doc
2055
-- Installing: /home/jenkins/workspace/Matrix_OnDemand/80361d7e/test-install/share/gromacs/top/oplsaa.ff/tip4pew.itp
2056
-- Installing: /home/jenkins/workspace/Matrix_OnDemand/80361d7e/test-install/share/gromacs/top/vdw-msms.dat
2057
-- Installing: /home/jenkins/workspace/Matrix_OnDemand/80361d7e/test-install/share/gromacs/top/sfactor.dat
2058
-- Installing: /home/jenkins/workspace/Matrix_OnDemand/80361d7e/test-install/share/gromacs/top/gromos43a2.ff
2059
-- Installing: /home/jenkins/workspace/Matrix_OnDemand/80361d7e/test-install/share/gromacs/top/gromos43a2.ff/tip4p.itp
2060
-- Installing: /home/jenkins/workspace/Matrix_OnDemand/80361d7e/test-install/share/gromacs/top/gromos43a2.ff/ffnonbonded.itp
2061
-- Installing: /home/jenkins/workspace/Matrix_OnDemand/80361d7e/test-install/share/gromacs/top/gromos43a2.ff/tip3p.itp
2062
-- Installing: /home/jenkins/workspace/Matrix_OnDemand/80361d7e/test-install/share/gromacs/top/gromos43a2.ff/aminoacids.r2b
2063
-- Installing: /home/jenkins/workspace/Matrix_OnDemand/80361d7e/test-install/share/gromacs/top/gromos43a2.ff/aminoacids.hdb
2064
-- Installing: /home/jenkins/workspace/Matrix_OnDemand/80361d7e/test-install/share/gromacs/top/gromos43a2.ff/aminoacids.vsd
2065
-- Installing: /home/jenkins/workspace/Matrix_OnDemand/80361d7e/test-install/share/gromacs/top/gromos43a2.ff/spce.itp
2066
-- Installing: /home/jenkins/workspace/Matrix_OnDemand/80361d7e/test-install/share/gromacs/top/gromos43a2.ff/aminoacids.n.tdb
2067
-- Installing: /home/jenkins/workspace/Matrix_OnDemand/80361d7e/test-install/share/gromacs/top/gromos43a2.ff/aminoacids.c.tdb
2068
-- Installing: /home/jenkins/workspace/Matrix_OnDemand/80361d7e/test-install/share/gromacs/top/gromos43a2.ff/ffbonded.itp
2069
-- Installing: /home/jenkins/workspace/Matrix_OnDemand/80361d7e/test-install/share/gromacs/top/gromos43a2.ff/aminoacids.rtp
2070
-- Installing: /home/jenkins/workspace/Matrix_OnDemand/80361d7e/test-install/share/gromacs/top/gromos43a2.ff/ff_dum.itp
2071
-- Installing: /home/jenkins/workspace/Matrix_OnDemand/80361d7e/test-install/share/gromacs/top/gromos43a2.ff/watermodels.dat
2072
-- Installing: /home/jenkins/workspace/Matrix_OnDemand/80361d7e/test-install/share/gromacs/top/gromos43a2.ff/ions.itp
2073
-- Installing: /home/jenkins/workspace/Matrix_OnDemand/80361d7e/test-install/share/gromacs/top/gromos43a2.ff/spc.itp
2074
-- Installing: /home/jenkins/workspace/Matrix_OnDemand/80361d7e/test-install/share/gromacs/top/gromos43a2.ff/forcefield.itp
2075
-- Installing: /home/jenkins/workspace/Matrix_OnDemand/80361d7e/test-install/share/gromacs/top/gromos43a2.ff/atomtypes.atp
2076
-- Installing: /home/jenkins/workspace/Matrix_OnDemand/80361d7e/test-install/share/gromacs/top/gromos43a2.ff/forcefield.doc
2077
-- Installing: /home/jenkins/workspace/Matrix_OnDemand/80361d7e/test-install/share/gromacs/top/table6-12.xvg
2078
-- Installing: /home/jenkins/workspace/Matrix_OnDemand/80361d7e/test-install/share/gromacs/top/ss.map
2079
-- Installing: /home/jenkins/workspace/Matrix_OnDemand/80361d7e/test-install/share/gromacs/top/refi_aa.dat
2080
-- Installing: /home/jenkins/workspace/Matrix_OnDemand/80361d7e/test-install/share/gromacs/top/residues.dtd
2081
-- Installing: /home/jenkins/workspace/Matrix_OnDemand/80361d7e/test-install/share/gromacs/top/phbres.dat
2082
-- Installing: /home/jenkins/workspace/Matrix_OnDemand/80361d7e/test-install/share/gromacs/top/ffG45a3.itp
2083
-- Installing: /home/jenkins/workspace/Matrix_OnDemand/80361d7e/test-install/share/gromacs/top/ca-shift.dat
2084
-- Installing: /home/jenkins/workspace/Matrix_OnDemand/80361d7e/test-install/share/gromacs/top/defselection.dat
2085
-- Installing: /home/jenkins/workspace/Matrix_OnDemand/80361d7e/test-install/share/gromacs/top/tip4p.gro
2086
-- Installing: /home/jenkins/workspace/Matrix_OnDemand/80361d7e/test-install/share/gromacs/top/residuetypes.dat
2087
-- Installing: /home/jenkins/workspace/Matrix_OnDemand/80361d7e/test-install/share/gromacs/top/atommass.dat
2088
-- Installing: /home/jenkins/workspace/Matrix_OnDemand/80361d7e/test-install/share/gromacs/top/ffG53a6.itp
2089
-- Installing: /home/jenkins/workspace/Matrix_OnDemand/80361d7e/test-install/share/gromacs/top/ffG53a5.itp
2090
-- Installing: /home/jenkins/workspace/Matrix_OnDemand/80361d7e/test-install/share/gromacs/top/xlateat.dat
2091
-- Installing: /home/jenkins/workspace/Matrix_OnDemand/80361d7e/test-install/share/gromacs/top/atom_nom.tbl
2092
-- Installing: /home/jenkins/workspace/Matrix_OnDemand/80361d7e/test-install/share/gromacs/top/ions.itp
2093
-- Installing: /home/jenkins/workspace/Matrix_OnDemand/80361d7e/test-install/share/gromacs/top/amber03.ff
2094
-- Installing: /home/jenkins/workspace/Matrix_OnDemand/80361d7e/test-install/share/gromacs/top/amber03.ff/aminoacids.arn
2095
-- Installing: /home/jenkins/workspace/Matrix_OnDemand/80361d7e/test-install/share/gromacs/top/amber03.ff/tip4p.itp
2096
-- Installing: /home/jenkins/workspace/Matrix_OnDemand/80361d7e/test-install/share/gromacs/top/amber03.ff/ffnonbonded.itp
2097
-- Installing: /home/jenkins/workspace/Matrix_OnDemand/80361d7e/test-install/share/gromacs/top/amber03.ff/tip5p.itp
2098
-- Installing: /home/jenkins/workspace/Matrix_OnDemand/80361d7e/test-install/share/gromacs/top/amber03.ff/tip3p.itp
2099
-- Installing: /home/jenkins/workspace/Matrix_OnDemand/80361d7e/test-install/share/gromacs/top/amber03.ff/aminoacids.r2b
2100
-- Installing: /home/jenkins/workspace/Matrix_OnDemand/80361d7e/test-install/share/gromacs/top/amber03.ff/aminoacids.hdb
2101
-- Installing: /home/jenkins/workspace/Matrix_OnDemand/80361d7e/test-install/share/gromacs/top/amber03.ff/aminoacids.vsd
2102
-- Installing: /home/jenkins/workspace/Matrix_OnDemand/80361d7e/test-install/share/gromacs/top/amber03.ff/rna.rtp
2103
-- Installing: /home/jenkins/workspace/Matrix_OnDemand/80361d7e/test-install/share/gromacs/top/amber03.ff/dna.arn
2104
-- Installing: /home/jenkins/workspace/Matrix_OnDemand/80361d7e/test-install/share/gromacs/top/amber03.ff/spce.itp
2105
-- Installing: /home/jenkins/workspace/Matrix_OnDemand/80361d7e/test-install/share/gromacs/top/amber03.ff/rna.arn
2106
-- Installing: /home/jenkins/workspace/Matrix_OnDemand/80361d7e/test-install/share/gromacs/top/amber03.ff/aminoacids.n.tdb
2107
-- Installing: /home/jenkins/workspace/Matrix_OnDemand/80361d7e/test-install/share/gromacs/top/amber03.ff/urea.itp
2108
-- Installing: /home/jenkins/workspace/Matrix_OnDemand/80361d7e/test-install/share/gromacs/top/amber03.ff/aminoacids.c.tdb
2109
-- Installing: /home/jenkins/workspace/Matrix_OnDemand/80361d7e/test-install/share/gromacs/top/amber03.ff/dna.rtp
2110
-- Installing: /home/jenkins/workspace/Matrix_OnDemand/80361d7e/test-install/share/gromacs/top/amber03.ff/ffbonded.itp
2111
-- Installing: /home/jenkins/workspace/Matrix_OnDemand/80361d7e/test-install/share/gromacs/top/amber03.ff/aminoacids.rtp
2112
-- Installing: /home/jenkins/workspace/Matrix_OnDemand/80361d7e/test-install/share/gromacs/top/amber03.ff/rna.r2b
2113
-- Installing: /home/jenkins/workspace/Matrix_OnDemand/80361d7e/test-install/share/gromacs/top/amber03.ff/watermodels.dat
2114
-- Installing: /home/jenkins/workspace/Matrix_OnDemand/80361d7e/test-install/share/gromacs/top/amber03.ff/dna.hdb
2115
-- Installing: /home/jenkins/workspace/Matrix_OnDemand/80361d7e/test-install/share/gromacs/top/amber03.ff/ions.itp
2116
-- Installing: /home/jenkins/workspace/Matrix_OnDemand/80361d7e/test-install/share/gromacs/top/amber03.ff/spc.itp
2117
-- Installing: /home/jenkins/workspace/Matrix_OnDemand/80361d7e/test-install/share/gromacs/top/amber03.ff/rna.hdb
2118
-- Installing: /home/jenkins/workspace/Matrix_OnDemand/80361d7e/test-install/share/gromacs/top/amber03.ff/dna.r2b
2119
-- Installing: /home/jenkins/workspace/Matrix_OnDemand/80361d7e/test-install/share/gromacs/top/amber03.ff/forcefield.itp
2120
-- Installing: /home/jenkins/workspace/Matrix_OnDemand/80361d7e/test-install/share/gromacs/top/amber03.ff/atomtypes.atp
2121
-- Installing: /home/jenkins/workspace/Matrix_OnDemand/80361d7e/test-install/share/gromacs/top/amber03.ff/forcefield.doc
2122
-- Installing: /home/jenkins/workspace/Matrix_OnDemand/80361d7e/test-install/share/gromacs/top/amber03.ff/tip4pew.itp
2123
-- Installing: /home/jenkins/workspace/Matrix_OnDemand/80361d7e/test-install/share/gromacs/top/spc.itp
2124
-- Installing: /home/jenkins/workspace/Matrix_OnDemand/80361d7e/test-install/share/gromacs/top/edissoc.dat
2125
-- Installing: /home/jenkins/workspace/Matrix_OnDemand/80361d7e/test-install/share/gromacs/top/flexwat-ferguson.itp
2126
-- Installing: /home/jenkins/workspace/Matrix_OnDemand/80361d7e/test-install/share/gromacs/top/ffoplsaa-n.tst
2127
-- Installing: /home/jenkins/workspace/Matrix_OnDemand/80361d7e/test-install/share/gromacs/top/specbond.dat
2128
-- Installing: /home/jenkins/workspace/Matrix_OnDemand/80361d7e/test-install/share/gromacs/top/gromos43a1.ff
2129
-- Installing: /home/jenkins/workspace/Matrix_OnDemand/80361d7e/test-install/share/gromacs/top/gromos43a1.ff/tip4p.itp
2130
-- Installing: /home/jenkins/workspace/Matrix_OnDemand/80361d7e/test-install/share/gromacs/top/gromos43a1.ff/ffnonbonded.itp
2131
-- Installing: /home/jenkins/workspace/Matrix_OnDemand/80361d7e/test-install/share/gromacs/top/gromos43a1.ff/tip3p.itp
2132
-- Installing: /home/jenkins/workspace/Matrix_OnDemand/80361d7e/test-install/share/gromacs/top/gromos43a1.ff/aminoacids.r2b
2133
-- Installing: /home/jenkins/workspace/Matrix_OnDemand/80361d7e/test-install/share/gromacs/top/gromos43a1.ff/aminoacids.hdb
2134
-- Installing: /home/jenkins/workspace/Matrix_OnDemand/80361d7e/test-install/share/gromacs/top/gromos43a1.ff/aminoacids.vsd
2135
-- Installing: /home/jenkins/workspace/Matrix_OnDemand/80361d7e/test-install/share/gromacs/top/gromos43a1.ff/methanol.itp
2136
-- Installing: /home/jenkins/workspace/Matrix_OnDemand/80361d7e/test-install/share/gromacs/top/gromos43a1.ff/spce.itp
2137
-- Installing: /home/jenkins/workspace/Matrix_OnDemand/80361d7e/test-install/share/gromacs/top/gromos43a1.ff/aminoacids.n.tdb
2138
-- Installing: /home/jenkins/workspace/Matrix_OnDemand/80361d7e/test-install/share/gromacs/top/gromos43a1.ff/aminoacids.c.tdb
2139
-- Installing: /home/jenkins/workspace/Matrix_OnDemand/80361d7e/test-install/share/gromacs/top/gromos43a1.ff/ffbonded.itp
2140
-- Installing: /home/jenkins/workspace/Matrix_OnDemand/80361d7e/test-install/share/gromacs/top/gromos43a1.ff/aminoacids.rtp
2141
-- Installing: /home/jenkins/workspace/Matrix_OnDemand/80361d7e/test-install/share/gromacs/top/gromos43a1.ff/ff_dum.itp
2142
-- Installing: /home/jenkins/workspace/Matrix_OnDemand/80361d7e/test-install/share/gromacs/top/gromos43a1.ff/watermodels.dat
2143
-- Installing: /home/jenkins/workspace/Matrix_OnDemand/80361d7e/test-install/share/gromacs/top/gromos43a1.ff/ions.itp
2144
-- Installing: /home/jenkins/workspace/Matrix_OnDemand/80361d7e/test-install/share/gromacs/top/gromos43a1.ff/spc.itp
2145
-- Installing: /home/jenkins/workspace/Matrix_OnDemand/80361d7e/test-install/share/gromacs/top/gromos43a1.ff/methanol216.gro
2146
-- Installing: /home/jenkins/workspace/Matrix_OnDemand/80361d7e/test-install/share/gromacs/top/gromos43a1.ff/forcefield.itp
2147
-- Installing: /home/jenkins/workspace/Matrix_OnDemand/80361d7e/test-install/share/gromacs/top/gromos43a1.ff/atomtypes.atp
2148
-- Installing: /home/jenkins/workspace/Matrix_OnDemand/80361d7e/test-install/share/gromacs/top/gromos43a1.ff/forcefield.doc
2149
-- Installing: /home/jenkins/workspace/Matrix_OnDemand/80361d7e/test-install/share/gromacs/top/tip5p.gro
2150
-- Installing: /home/jenkins/workspace/Matrix_OnDemand/80361d7e/test-install/share/gromacs/top/flexspc.itp
2151
-- Installing: /home/jenkins/workspace/Matrix_OnDemand/80361d7e/test-install/share/gromacs/top/amber99sb-ildn.ff
2152
-- Installing: /home/jenkins/workspace/Matrix_OnDemand/80361d7e/test-install/share/gromacs/top/amber99sb-ildn.ff/aminoacids.arn
2153
-- Installing: /home/jenkins/workspace/Matrix_OnDemand/80361d7e/test-install/share/gromacs/top/amber99sb-ildn.ff/tip4p.itp
2154
-- Installing: /home/jenkins/workspace/Matrix_OnDemand/80361d7e/test-install/share/gromacs/top/amber99sb-ildn.ff/ffnonbonded.itp
2155
-- Installing: /home/jenkins/workspace/Matrix_OnDemand/80361d7e/test-install/share/gromacs/top/amber99sb-ildn.ff/tip5p.itp
2156
-- Installing: /home/jenkins/workspace/Matrix_OnDemand/80361d7e/test-install/share/gromacs/top/amber99sb-ildn.ff/tip3p.itp
2157
-- Installing: /home/jenkins/workspace/Matrix_OnDemand/80361d7e/test-install/share/gromacs/top/amber99sb-ildn.ff/aminoacids.r2b
2158
-- Installing: /home/jenkins/workspace/Matrix_OnDemand/80361d7e/test-install/share/gromacs/top/amber99sb-ildn.ff/aminoacids.hdb
2159
-- Installing: /home/jenkins/workspace/Matrix_OnDemand/80361d7e/test-install/share/gromacs/top/amber99sb-ildn.ff/aminoacids.vsd
2160
-- Installing: /home/jenkins/workspace/Matrix_OnDemand/80361d7e/test-install/share/gromacs/top/amber99sb-ildn.ff/rna.rtp
2161
-- Installing: /home/jenkins/workspace/Matrix_OnDemand/80361d7e/test-install/share/gromacs/top/amber99sb-ildn.ff/dna.arn
2162
-- Installing: /home/jenkins/workspace/Matrix_OnDemand/80361d7e/test-install/share/gromacs/top/amber99sb-ildn.ff/spce.itp
2163
-- Installing: /home/jenkins/workspace/Matrix_OnDemand/80361d7e/test-install/share/gromacs/top/amber99sb-ildn.ff/rna.arn
2164
-- Installing: /home/jenkins/workspace/Matrix_OnDemand/80361d7e/test-install/share/gromacs/top/amber99sb-ildn.ff/aminoacids.n.tdb
2165
-- Installing: /home/jenkins/workspace/Matrix_OnDemand/80361d7e/test-install/share/gromacs/top/amber99sb-ildn.ff/urea.itp
2166
-- Installing: /home/jenkins/workspace/Matrix_OnDemand/80361d7e/test-install/share/gromacs/top/amber99sb-ildn.ff/aminoacids.c.tdb
2167
-- Installing: /home/jenkins/workspace/Matrix_OnDemand/80361d7e/test-install/share/gromacs/top/amber99sb-ildn.ff/dna.rtp
2168
-- Installing: /home/jenkins/workspace/Matrix_OnDemand/80361d7e/test-install/share/gromacs/top/amber99sb-ildn.ff/ffbonded.itp
2169
-- Installing: /home/jenkins/workspace/Matrix_OnDemand/80361d7e/test-install/share/gromacs/top/amber99sb-ildn.ff/aminoacids.rtp
2170
-- Installing: /home/jenkins/workspace/Matrix_OnDemand/80361d7e/test-install/share/gromacs/top/amber99sb-ildn.ff/rna.r2b
2171
-- Installing: /home/jenkins/workspace/Matrix_OnDemand/80361d7e/test-install/share/gromacs/top/amber99sb-ildn.ff/watermodels.dat
2172
-- Installing: /home/jenkins/workspace/Matrix_OnDemand/80361d7e/test-install/share/gromacs/top/amber99sb-ildn.ff/dna.hdb
2173
-- Installing: /home/jenkins/workspace/Matrix_OnDemand/80361d7e/test-install/share/gromacs/top/amber99sb-ildn.ff/ions.itp
2174
-- Installing: /home/jenkins/workspace/Matrix_OnDemand/80361d7e/test-install/share/gromacs/top/amber99sb-ildn.ff/spc.itp
2175
-- Installing: /home/jenkins/workspace/Matrix_OnDemand/80361d7e/test-install/share/gromacs/top/amber99sb-ildn.ff/rna.hdb
2176
-- Installing: /home/jenkins/workspace/Matrix_OnDemand/80361d7e/test-install/share/gromacs/top/amber99sb-ildn.ff/dna.r2b
2177
-- Installing: /home/jenkins/workspace/Matrix_OnDemand/80361d7e/test-install/share/gromacs/top/amber99sb-ildn.ff/forcefield.itp
2178
-- Installing: /home/jenkins/workspace/Matrix_OnDemand/80361d7e/test-install/share/gromacs/top/amber99sb-ildn.ff/atomtypes.atp
2179
-- Installing: /home/jenkins/workspace/Matrix_OnDemand/80361d7e/test-install/share/gromacs/top/amber99sb-ildn.ff/forcefield.doc
2180
-- Installing: /home/jenkins/workspace/Matrix_OnDemand/80361d7e/test-install/share/gromacs/top/amber99sb-ildn.ff/tip4pew.itp
2181
-- Installing: /home/jenkins/workspace/Matrix_OnDemand/80361d7e/test-install/share/gromacs/top/ha-shift.dat
2182
-- Installing: /home/jenkins/workspace/Matrix_OnDemand/80361d7e/test-install/share/gromacs/top/table6-10.xvg
2183
-- Installing: /home/jenkins/workspace/Matrix_OnDemand/80361d7e/test-install/share/gromacs/top/electroneg.dat
2184
-- Installing: /home/jenkins/workspace/Matrix_OnDemand/80361d7e/test-install/share/gromacs/top/table6-9.xvg
2185
-- Installing: /home/jenkins/workspace/Matrix_OnDemand/80361d7e/test-install/share/gromacs/top/amber96.ff
2186
-- Installing: /home/jenkins/workspace/Matrix_OnDemand/80361d7e/test-install/share/gromacs/top/amber96.ff/aminoacids.arn
2187
-- Installing: /home/jenkins/workspace/Matrix_OnDemand/80361d7e/test-install/share/gromacs/top/amber96.ff/tip4p.itp
2188
-- Installing: /home/jenkins/workspace/Matrix_OnDemand/80361d7e/test-install/share/gromacs/top/amber96.ff/ffnonbonded.itp
2189
-- Installing: /home/jenkins/workspace/Matrix_OnDemand/80361d7e/test-install/share/gromacs/top/amber96.ff/tip5p.itp
2190
-- Installing: /home/jenkins/workspace/Matrix_OnDemand/80361d7e/test-install/share/gromacs/top/amber96.ff/tip3p.itp
2191
-- Installing: /home/jenkins/workspace/Matrix_OnDemand/80361d7e/test-install/share/gromacs/top/amber96.ff/aminoacids.r2b
2192
-- Installing: /home/jenkins/workspace/Matrix_OnDemand/80361d7e/test-install/share/gromacs/top/amber96.ff/aminoacids.hdb
2193
-- Installing: /home/jenkins/workspace/Matrix_OnDemand/80361d7e/test-install/share/gromacs/top/amber96.ff/aminoacids.vsd
2194
-- Installing: /home/jenkins/workspace/Matrix_OnDemand/80361d7e/test-install/share/gromacs/top/amber96.ff/rna.rtp
2195
-- Installing: /home/jenkins/workspace/Matrix_OnDemand/80361d7e/test-install/share/gromacs/top/amber96.ff/dna.arn
2196
-- Installing: /home/jenkins/workspace/Matrix_OnDemand/80361d7e/test-install/share/gromacs/top/amber96.ff/spce.itp
2197
-- Installing: /home/jenkins/workspace/Matrix_OnDemand/80361d7e/test-install/share/gromacs/top/amber96.ff/rna.arn
2198
-- Installing: /home/jenkins/workspace/Matrix_OnDemand/80361d7e/test-install/share/gromacs/top/amber96.ff/aminoacids.n.tdb
2199
-- Installing: /home/jenkins/workspace/Matrix_OnDemand/80361d7e/test-install/share/gromacs/top/amber96.ff/urea.itp
2200
-- Installing: /home/jenkins/workspace/Matrix_OnDemand/80361d7e/test-install/share/gromacs/top/amber96.ff/aminoacids.c.tdb
2201
-- Installing: /home/jenkins/workspace/Matrix_OnDemand/80361d7e/test-install/share/gromacs/top/amber96.ff/dna.rtp
2202
-- Installing: /home/jenkins/workspace/Matrix_OnDemand/80361d7e/test-install/share/gromacs/top/amber96.ff/ffbonded.itp
2203
-- Installing: /home/jenkins/workspace/Matrix_OnDemand/80361d7e/test-install/share/gromacs/top/amber96.ff/aminoacids.rtp
2204
-- Installing: /home/jenkins/workspace/Matrix_OnDemand/80361d7e/test-install/share/gromacs/top/amber96.ff/rna.r2b
2205
-- Installing: /home/jenkins/workspace/Matrix_OnDemand/80361d7e/test-install/share/gromacs/top/amber96.ff/watermodels.dat
2206
-- Installing: /home/jenkins/workspace/Matrix_OnDemand/80361d7e/test-install/share/gromacs/top/amber96.ff/dna.hdb
2207
-- Installing: /home/jenkins/workspace/Matrix_OnDemand/80361d7e/test-install/share/gromacs/top/amber96.ff/ions.itp
2208
-- Installing: /home/jenkins/workspace/Matrix_OnDemand/80361d7e/test-install/share/gromacs/top/amber96.ff/spc.itp
2209
-- Installing: /home/jenkins/workspace/Matrix_OnDemand/80361d7e/test-install/share/gromacs/top/amber96.ff/rna.hdb
2210
-- Installing: /home/jenkins/workspace/Matrix_OnDemand/80361d7e/test-install/share/gromacs/top/amber96.ff/dna.r2b
2211
-- Installing: /home/jenkins/workspace/Matrix_OnDemand/80361d7e/test-install/share/gromacs/top/amber96.ff/forcefield.itp
2212
-- Installing: /home/jenkins/workspace/Matrix_OnDemand/80361d7e/test-install/share/gromacs/top/amber96.ff/atomtypes.atp
2213
-- Installing: /home/jenkins/workspace/Matrix_OnDemand/80361d7e/test-install/share/gromacs/top/amber96.ff/forcefield.doc
2214
-- Installing: /home/jenkins/workspace/Matrix_OnDemand/80361d7e/test-install/share/gromacs/top/amber96.ff/tip4pew.itp
2215
-- Installing: /home/jenkins/workspace/Matrix_OnDemand/80361d7e/test-install/share/gromacs/top/table6-8.xvg
2216
-- Installing: /home/jenkins/workspace/Matrix_OnDemand/80361d7e/test-install/share/gromacs/top/gromos53a5.ff
2217
-- Installing: /home/jenkins/workspace/Matrix_OnDemand/80361d7e/test-install/share/gromacs/top/gromos53a5.ff/tip4p.itp
2218
-- Installing: /home/jenkins/workspace/Matrix_OnDemand/80361d7e/test-install/share/gromacs/top/gromos53a5.ff/ffnonbonded.itp
2219
-- Installing: /home/jenkins/workspace/Matrix_OnDemand/80361d7e/test-install/share/gromacs/top/gromos53a5.ff/tip3p.itp
2220
-- Installing: /home/jenkins/workspace/Matrix_OnDemand/80361d7e/test-install/share/gromacs/top/gromos53a5.ff/aminoacids.r2b
2221
-- Installing: /home/jenkins/workspace/Matrix_OnDemand/80361d7e/test-install/share/gromacs/top/gromos53a5.ff/aminoacids.hdb
2222
-- Installing: /home/jenkins/workspace/Matrix_OnDemand/80361d7e/test-install/share/gromacs/top/gromos53a5.ff/aminoacids.vsd
2223
-- Installing: /home/jenkins/workspace/Matrix_OnDemand/80361d7e/test-install/share/gromacs/top/gromos53a5.ff/spce.itp
2224
-- Installing: /home/jenkins/workspace/Matrix_OnDemand/80361d7e/test-install/share/gromacs/top/gromos53a5.ff/aminoacids.n.tdb
2225
-- Installing: /home/jenkins/workspace/Matrix_OnDemand/80361d7e/test-install/share/gromacs/top/gromos53a5.ff/aminoacids.c.tdb
2226
-- Installing: /home/jenkins/workspace/Matrix_OnDemand/80361d7e/test-install/share/gromacs/top/gromos53a5.ff/ffbonded.itp
2227
-- Installing: /home/jenkins/workspace/Matrix_OnDemand/80361d7e/test-install/share/gromacs/top/gromos53a5.ff/aminoacids.rtp
2228
-- Installing: /home/jenkins/workspace/Matrix_OnDemand/80361d7e/test-install/share/gromacs/top/gromos53a5.ff/ff_dum.itp
2229
-- Installing: /home/jenkins/workspace/Matrix_OnDemand/80361d7e/test-install/share/gromacs/top/gromos53a5.ff/atomname2type.n2t
2230
-- Installing: /home/jenkins/workspace/Matrix_OnDemand/80361d7e/test-install/share/gromacs/top/gromos53a5.ff/watermodels.dat
2231
-- Installing: /home/jenkins/workspace/Matrix_OnDemand/80361d7e/test-install/share/gromacs/top/gromos53a5.ff/ions.itp
2232
-- Installing: /home/jenkins/workspace/Matrix_OnDemand/80361d7e/test-install/share/gromacs/top/gromos53a5.ff/spc.itp
2233
-- Installing: /home/jenkins/workspace/Matrix_OnDemand/80361d7e/test-install/share/gromacs/top/gromos53a5.ff/forcefield.itp
2234
-- Installing: /home/jenkins/workspace/Matrix_OnDemand/80361d7e/test-install/share/gromacs/top/gromos53a5.ff/atomtypes.atp
2235
-- Installing: /home/jenkins/workspace/Matrix_OnDemand/80361d7e/test-install/share/gromacs/top/gromos53a5.ff/forcefield.doc
2236
-- Installing: /home/jenkins/workspace/Matrix_OnDemand/80361d7e/test-install/share/gromacs/top/ffG43a1.itp
2237
-- Installing: /home/jenkins/workspace/Matrix_OnDemand/80361d7e/test-install/share/gromacs/top/dgsolv.dat
2238
-- Installing: /home/jenkins/workspace/Matrix_OnDemand/80361d7e/test-install/share/gromacs/top/surface.dat
2239
-- Installing: /home/jenkins/workspace/Matrix_OnDemand/80361d7e/test-install/share/gromacs/top/gromos45a3.ff
2240
-- Installing: /home/jenkins/workspace/Matrix_OnDemand/80361d7e/test-install/share/gromacs/top/gromos45a3.ff/tip4p.itp
2241
-- Installing: /home/jenkins/workspace/Matrix_OnDemand/80361d7e/test-install/share/gromacs/top/gromos45a3.ff/ffnonbonded.itp
2242
-- Installing: /home/jenkins/workspace/Matrix_OnDemand/80361d7e/test-install/share/gromacs/top/gromos45a3.ff/tip3p.itp
2243
-- Installing: /home/jenkins/workspace/Matrix_OnDemand/80361d7e/test-install/share/gromacs/top/gromos45a3.ff/aminoacids.r2b
2244
-- Installing: /home/jenkins/workspace/Matrix_OnDemand/80361d7e/test-install/share/gromacs/top/gromos45a3.ff/aminoacids.hdb
2245
-- Installing: /home/jenkins/workspace/Matrix_OnDemand/80361d7e/test-install/share/gromacs/top/gromos45a3.ff/aminoacids.vsd
2246
-- Installing: /home/jenkins/workspace/Matrix_OnDemand/80361d7e/test-install/share/gromacs/top/gromos45a3.ff/spce.itp
2247
-- Installing: /home/jenkins/workspace/Matrix_OnDemand/80361d7e/test-install/share/gromacs/top/gromos45a3.ff/aminoacids.n.tdb
2248
-- Installing: /home/jenkins/workspace/Matrix_OnDemand/80361d7e/test-install/share/gromacs/top/gromos45a3.ff/aminoacids.c.tdb
2249
-- Installing: /home/jenkins/workspace/Matrix_OnDemand/80361d7e/test-install/share/gromacs/top/gromos45a3.ff/ffbonded.itp
2250
-- Installing: /home/jenkins/workspace/Matrix_OnDemand/80361d7e/test-install/share/gromacs/top/gromos45a3.ff/aminoacids.rtp
2251
-- Installing: /home/jenkins/workspace/Matrix_OnDemand/80361d7e/test-install/share/gromacs/top/gromos45a3.ff/ff_dum.itp
2252
-- Installing: /home/jenkins/workspace/Matrix_OnDemand/80361d7e/test-install/share/gromacs/top/gromos45a3.ff/watermodels.dat
2253
-- Installing: /home/jenkins/workspace/Matrix_OnDemand/80361d7e/test-install/share/gromacs/top/gromos45a3.ff/ions.itp
2254
-- Installing: /home/jenkins/workspace/Matrix_OnDemand/80361d7e/test-install/share/gromacs/top/gromos45a3.ff/spc.itp
2255
-- Installing: /home/jenkins/workspace/Matrix_OnDemand/80361d7e/test-install/share/gromacs/top/gromos45a3.ff/forcefield.itp
2256
-- Installing: /home/jenkins/workspace/Matrix_OnDemand/80361d7e/test-install/share/gromacs/top/gromos45a3.ff/atomtypes.atp
2257
-- Installing: /home/jenkins/workspace/Matrix_OnDemand/80361d7e/test-install/share/gromacs/top/gromos45a3.ff/forcefield.doc
2258
-- Installing: /home/jenkins/workspace/Matrix_OnDemand/80361d7e/test-install/share/gromacs/top/gromos53a6.ff
2259
-- Installing: /home/jenkins/workspace/Matrix_OnDemand/80361d7e/test-install/share/gromacs/top/gromos53a6.ff/tip4p.itp
2260
-- Installing: /home/jenkins/workspace/Matrix_OnDemand/80361d7e/test-install/share/gromacs/top/gromos53a6.ff/ffnonbonded.itp
2261
-- Installing: /home/jenkins/workspace/Matrix_OnDemand/80361d7e/test-install/share/gromacs/top/gromos53a6.ff/tip3p.itp
2262
-- Installing: /home/jenkins/workspace/Matrix_OnDemand/80361d7e/test-install/share/gromacs/top/gromos53a6.ff/aminoacids.r2b
2263
-- Installing: /home/jenkins/workspace/Matrix_OnDemand/80361d7e/test-install/share/gromacs/top/gromos53a6.ff/aminoacids.hdb
2264
-- Installing: /home/jenkins/workspace/Matrix_OnDemand/80361d7e/test-install/share/gromacs/top/gromos53a6.ff/aminoacids.vsd
2265
-- Installing: /home/jenkins/workspace/Matrix_OnDemand/80361d7e/test-install/share/gromacs/top/gromos53a6.ff/spce.itp
2266
-- Installing: /home/jenkins/workspace/Matrix_OnDemand/80361d7e/test-install/share/gromacs/top/gromos53a6.ff/aminoacids.n.tdb
2267
-- Installing: /home/jenkins/workspace/Matrix_OnDemand/80361d7e/test-install/share/gromacs/top/gromos53a6.ff/aminoacids.c.tdb
2268
-- Installing: /home/jenkins/workspace/Matrix_OnDemand/80361d7e/test-install/share/gromacs/top/gromos53a6.ff/ffbonded.itp
2269
-- Installing: /home/jenkins/workspace/Matrix_OnDemand/80361d7e/test-install/share/gromacs/top/gromos53a6.ff/aminoacids.rtp
2270
-- Installing: /home/jenkins/workspace/Matrix_OnDemand/80361d7e/test-install/share/gromacs/top/gromos53a6.ff/ff_dum.itp
2271
-- Installing: /home/jenkins/workspace/Matrix_OnDemand/80361d7e/test-install/share/gromacs/top/gromos53a6.ff/watermodels.dat
2272
-- Installing: /home/jenkins/workspace/Matrix_OnDemand/80361d7e/test-install/share/gromacs/top/gromos53a6.ff/ions.itp
2273
-- Installing: /home/jenkins/workspace/Matrix_OnDemand/80361d7e/test-install/share/gromacs/top/gromos53a6.ff/spc.itp
2274
-- Installing: /home/jenkins/workspace/Matrix_OnDemand/80361d7e/test-install/share/gromacs/top/gromos53a6.ff/forcefield.itp
2275
-- Installing: /home/jenkins/workspace/Matrix_OnDemand/80361d7e/test-install/share/gromacs/top/gromos53a6.ff/atomtypes.atp
2276
-- Installing: /home/jenkins/workspace/Matrix_OnDemand/80361d7e/test-install/share/gromacs/top/gromos53a6.ff/forcefield.doc
2277
-- Installing: /home/jenkins/workspace/Matrix_OnDemand/80361d7e/test-install/share/gromacs/top/flexspce.itp
2278
-- Installing: /home/jenkins/workspace/Matrix_OnDemand/80361d7e/test-install/share/gromacs/top/co-shift.dat
2279
-- Installing: /home/jenkins/workspace/Matrix_OnDemand/80361d7e/test-install/share/gromacs/top/charmm27.ff
2280
-- Installing: /home/jenkins/workspace/Matrix_OnDemand/80361d7e/test-install/share/gromacs/top/charmm27.ff/aminoacids.arn
2281
-- Installing: /home/jenkins/workspace/Matrix_OnDemand/80361d7e/test-install/share/gromacs/top/charmm27.ff/tip4p.itp
2282
-- Installing: /home/jenkins/workspace/Matrix_OnDemand/80361d7e/test-install/share/gromacs/top/charmm27.ff/lipids.hdb
2283
-- Installing: /home/jenkins/workspace/Matrix_OnDemand/80361d7e/test-install/share/gromacs/top/charmm27.ff/ffnonbonded.itp
2284
-- Installing: /home/jenkins/workspace/Matrix_OnDemand/80361d7e/test-install/share/gromacs/top/charmm27.ff/tips3p.itp
2285
-- Installing: /home/jenkins/workspace/Matrix_OnDemand/80361d7e/test-install/share/gromacs/top/charmm27.ff/tip5p.itp
2286
-- Installing: /home/jenkins/workspace/Matrix_OnDemand/80361d7e/test-install/share/gromacs/top/charmm27.ff/tip3p.itp
2287
-- Installing: /home/jenkins/workspace/Matrix_OnDemand/80361d7e/test-install/share/gromacs/top/charmm27.ff/aminoacids.r2b
2288
-- Installing: /home/jenkins/workspace/Matrix_OnDemand/80361d7e/test-install/share/gromacs/top/charmm27.ff/aminoacids.hdb
2289
-- Installing: /home/jenkins/workspace/Matrix_OnDemand/80361d7e/test-install/share/gromacs/top/charmm27.ff/dna.c.tdb
2290
-- Installing: /home/jenkins/workspace/Matrix_OnDemand/80361d7e/test-install/share/gromacs/top/charmm27.ff/dna.n.tdb
2291
-- Installing: /home/jenkins/workspace/Matrix_OnDemand/80361d7e/test-install/share/gromacs/top/charmm27.ff/aminoacids.vsd
2292
-- Installing: /home/jenkins/workspace/Matrix_OnDemand/80361d7e/test-install/share/gromacs/top/charmm27.ff/rna.rtp
2293
-- Installing: /home/jenkins/workspace/Matrix_OnDemand/80361d7e/test-install/share/gromacs/top/charmm27.ff/dna.arn
2294
-- Installing: /home/jenkins/workspace/Matrix_OnDemand/80361d7e/test-install/share/gromacs/top/charmm27.ff/spce.itp
2295
-- Installing: /home/jenkins/workspace/Matrix_OnDemand/80361d7e/test-install/share/gromacs/top/charmm27.ff/rna.arn
2296
-- Installing: /home/jenkins/workspace/Matrix_OnDemand/80361d7e/test-install/share/gromacs/top/charmm27.ff/aminoacids.n.tdb
2297
-- Installing: /home/jenkins/workspace/Matrix_OnDemand/80361d7e/test-install/share/gromacs/top/charmm27.ff/aminoacids.c.tdb
2298
-- Installing: /home/jenkins/workspace/Matrix_OnDemand/80361d7e/test-install/share/gromacs/top/charmm27.ff/dna.rtp
2299
-- Installing: /home/jenkins/workspace/Matrix_OnDemand/80361d7e/test-install/share/gromacs/top/charmm27.ff/ffbonded.itp
2300
-- Installing: /home/jenkins/workspace/Matrix_OnDemand/80361d7e/test-install/share/gromacs/top/charmm27.ff/aminoacids.rtp
2301
-- Installing: /home/jenkins/workspace/Matrix_OnDemand/80361d7e/test-install/share/gromacs/top/charmm27.ff/rna.r2b
2302
-- Installing: /home/jenkins/workspace/Matrix_OnDemand/80361d7e/test-install/share/gromacs/top/charmm27.ff/watermodels.dat
2303
-- Installing: /home/jenkins/workspace/Matrix_OnDemand/80361d7e/test-install/share/gromacs/top/charmm27.ff/dna.hdb
2304
-- Installing: /home/jenkins/workspace/Matrix_OnDemand/80361d7e/test-install/share/gromacs/top/charmm27.ff/lipids.rtp
2305
-- Installing: /home/jenkins/workspace/Matrix_OnDemand/80361d7e/test-install/share/gromacs/top/charmm27.ff/ions.itp
2306
-- Installing: /home/jenkins/workspace/Matrix_OnDemand/80361d7e/test-install/share/gromacs/top/charmm27.ff/spc.itp
2307
-- Installing: /home/jenkins/workspace/Matrix_OnDemand/80361d7e/test-install/share/gromacs/top/charmm27.ff/ffnabonded.itp
2308
-- Installing: /home/jenkins/workspace/Matrix_OnDemand/80361d7e/test-install/share/gromacs/top/charmm27.ff/rna.hdb
2309
-- Installing: /home/jenkins/workspace/Matrix_OnDemand/80361d7e/test-install/share/gromacs/top/charmm27.ff/rna.c.tdb
2310
-- Installing: /home/jenkins/workspace/Matrix_OnDemand/80361d7e/test-install/share/gromacs/top/charmm27.ff/cmap.itp
2311
-- Installing: /home/jenkins/workspace/Matrix_OnDemand/80361d7e/test-install/share/gromacs/top/charmm27.ff/forcefield.itp
2312
-- Installing: /home/jenkins/workspace/Matrix_OnDemand/80361d7e/test-install/share/gromacs/top/charmm27.ff/ffnanonbonded.itp
2313
-- Installing: /home/jenkins/workspace/Matrix_OnDemand/80361d7e/test-install/share/gromacs/top/charmm27.ff/atomtypes.atp
2314
-- Installing: /home/jenkins/workspace/Matrix_OnDemand/80361d7e/test-install/share/gromacs/top/charmm27.ff/rna.n.tdb
2315
-- Installing: /home/jenkins/workspace/Matrix_OnDemand/80361d7e/test-install/share/gromacs/top/charmm27.ff/forcefield.doc
2316
-- Installing: /home/jenkins/workspace/Matrix_OnDemand/80361d7e/test-install/share/gromacs/top/nsfactor.dat
2317
-- Installing: /home/jenkins/workspace/Matrix_OnDemand/80361d7e/test-install/share/gromacs/top/table6-11.xvg
2318
-- Installing: /home/jenkins/workspace/Matrix_OnDemand/80361d7e/test-install/share/gromacs/top/README
2319
-- Installing: /home/jenkins/workspace/Matrix_OnDemand/80361d7e/test-install/share/gromacs/top/ffG43a2.itp
2320
-- Installing: /home/jenkins/workspace/Matrix_OnDemand/80361d7e/test-install/share/gromacs/top/gromos54a7.ff
2321
-- Installing: /home/jenkins/workspace/Matrix_OnDemand/80361d7e/test-install/share/gromacs/top/gromos54a7.ff/tip4p.itp
2322
-- Installing: /home/jenkins/workspace/Matrix_OnDemand/80361d7e/test-install/share/gromacs/top/gromos54a7.ff/ffnonbonded.itp
2323
-- Installing: /home/jenkins/workspace/Matrix_OnDemand/80361d7e/test-install/share/gromacs/top/gromos54a7.ff/tip3p.itp
2324
-- Installing: /home/jenkins/workspace/Matrix_OnDemand/80361d7e/test-install/share/gromacs/top/gromos54a7.ff/aminoacids.r2b
2325
-- Installing: /home/jenkins/workspace/Matrix_OnDemand/80361d7e/test-install/share/gromacs/top/gromos54a7.ff/aminoacids.hdb
2326
-- Installing: /home/jenkins/workspace/Matrix_OnDemand/80361d7e/test-install/share/gromacs/top/gromos54a7.ff/aminoacids.vsd
2327
-- Installing: /home/jenkins/workspace/Matrix_OnDemand/80361d7e/test-install/share/gromacs/top/gromos54a7.ff/spce.itp
2328
-- Installing: /home/jenkins/workspace/Matrix_OnDemand/80361d7e/test-install/share/gromacs/top/gromos54a7.ff/dppc.itp
2329
-- Installing: /home/jenkins/workspace/Matrix_OnDemand/80361d7e/test-install/share/gromacs/top/gromos54a7.ff/aminoacids.n.tdb
2330
-- Installing: /home/jenkins/workspace/Matrix_OnDemand/80361d7e/test-install/share/gromacs/top/gromos54a7.ff/aminoacids.c.tdb
2331
-- Installing: /home/jenkins/workspace/Matrix_OnDemand/80361d7e/test-install/share/gromacs/top/gromos54a7.ff/popc.itp
2332
-- Installing: /home/jenkins/workspace/Matrix_OnDemand/80361d7e/test-install/share/gromacs/top/gromos54a7.ff/ffbonded.itp
2333
-- Installing: /home/jenkins/workspace/Matrix_OnDemand/80361d7e/test-install/share/gromacs/top/gromos54a7.ff/aminoacids.rtp
2334
-- Installing: /home/jenkins/workspace/Matrix_OnDemand/80361d7e/test-install/share/gromacs/top/gromos54a7.ff/ff_dum.itp
2335
-- Installing: /home/jenkins/workspace/Matrix_OnDemand/80361d7e/test-install/share/gromacs/top/gromos54a7.ff/watermodels.dat
2336
-- Installing: /home/jenkins/workspace/Matrix_OnDemand/80361d7e/test-install/share/gromacs/top/gromos54a7.ff/ions.itp
2337
-- Installing: /home/jenkins/workspace/Matrix_OnDemand/80361d7e/test-install/share/gromacs/top/gromos54a7.ff/spc.itp
2338
-- Installing: /home/jenkins/workspace/Matrix_OnDemand/80361d7e/test-install/share/gromacs/top/gromos54a7.ff/tmcl.itp
2339
-- Installing: /home/jenkins/workspace/Matrix_OnDemand/80361d7e/test-install/share/gromacs/top/gromos54a7.ff/forcefield.itp
2340
-- Installing: /home/jenkins/workspace/Matrix_OnDemand/80361d7e/test-install/share/gromacs/top/gromos54a7.ff/atomtypes.atp
2341
-- Installing: /home/jenkins/workspace/Matrix_OnDemand/80361d7e/test-install/share/gromacs/top/gromos54a7.ff/forcefield.doc
2342
-- Installing: /home/jenkins/workspace/Matrix_OnDemand/80361d7e/test-install/share/gromacs/top/elements.dat
2343
-- Installing: /home/jenkins/workspace/Matrix_OnDemand/80361d7e/test-install/share/gromacs/template/CMakeLists.txt
2344
-- Installing: /home/jenkins/workspace/Matrix_OnDemand/80361d7e/test-install/share/gromacs/template/README
2345
-- Installing: /home/jenkins/workspace/Matrix_OnDemand/80361d7e/test-install/share/gromacs/template/template.cpp
2346
-- Installing: /home/jenkins/workspace/Matrix_OnDemand/80361d7e/test-install/share/gromacs/template/Makefile.pkg
2347
-- Installing: /home/jenkins/workspace/Matrix_OnDemand/80361d7e/test-install/share/gromacs/template/cmake/FindGROMACS.cmake
2348
-- Installing: /home/jenkins/workspace/Matrix_OnDemand/80361d7e/test-install/bin/GMXRC
2349
-- Installing: /home/jenkins/workspace/Matrix_OnDemand/80361d7e/test-install/bin/GMXRC.bash
2350
-- Installing: /home/jenkins/workspace/Matrix_OnDemand/80361d7e/test-install/bin/GMXRC.zsh
2351
-- Installing: /home/jenkins/workspace/Matrix_OnDemand/80361d7e/test-install/bin/GMXRC.csh
2352
-- Installing: /home/jenkins/workspace/Matrix_OnDemand/80361d7e/test-install/bin/demux.pl
2353
-- Installing: /home/jenkins/workspace/Matrix_OnDemand/80361d7e/test-install/bin/xplor2gmx.pl
2354
-- Installing: /home/jenkins/workspace/Matrix_OnDemand/80361d7e/test-install/lib/libgromacs.so.5.0.0
2355
-- Installing: /home/jenkins/workspace/Matrix_OnDemand/80361d7e/test-install/lib/libgromacs.so.5
2356
-- Installing: /home/jenkins/workspace/Matrix_OnDemand/80361d7e/test-install/lib/libgromacs.so
2357
-- Installing: /home/jenkins/workspace/Matrix_OnDemand/80361d7e/test-install/lib/pkgconfig/libgromacs.pc
2358
-- Installing: /home/jenkins/workspace/Matrix_OnDemand/80361d7e/test-install/share/cmake/gromacs/libgromacs.cmake
2359
-- Installing: /home/jenkins/workspace/Matrix_OnDemand/80361d7e/test-install/share/cmake/gromacs/libgromacs-debug.cmake
2360
-- Installing: /home/jenkins/workspace/Matrix_OnDemand/80361d7e/test-install/share/cmake/gromacs/gromacs-config.cmake
2361
-- Installing: /home/jenkins/workspace/Matrix_OnDemand/80361d7e/test-install/share/cmake/gromacs/gromacs-config-version.cmake
2362
-- Installing: /home/jenkins/workspace/Matrix_OnDemand/80361d7e/test-install/share/cmake/gromacs/gromacs-toolchain.cmake
2363
-- Installing: /home/jenkins/workspace/Matrix_OnDemand/80361d7e/test-install/share/gromacs/opencl/gromacs/gpu_utils/device_utils.clh
2364
-- Installing: /home/jenkins/workspace/Matrix_OnDemand/80361d7e/test-install/share/gromacs/opencl/gromacs/gpu_utils/vectype_ops.clh
2365
-- Installing: /home/jenkins/workspace/Matrix_OnDemand/80361d7e/test-install/share/gromacs/opencl/gromacs/pbcutil/ishift.h
2366
-- Installing: /home/jenkins/workspace/Matrix_OnDemand/80361d7e/test-install/share/gromacs/opencl/gromacs/nbnxm/constants.h
2367
-- Installing: /home/jenkins/workspace/Matrix_OnDemand/80361d7e/test-install/share/gromacs/opencl/gromacs/nbnxm/opencl/nbnxm_ocl_consts.h
2368
-- Installing: /home/jenkins/workspace/Matrix_OnDemand/80361d7e/test-install/share/gromacs/opencl/gromacs/nbnxm/opencl/nbnxm_ocl_kernel.clh
2369
-- Installing: /home/jenkins/workspace/Matrix_OnDemand/80361d7e/test-install/share/gromacs/opencl/gromacs/nbnxm/opencl/nbnxm_ocl_kernel_pruneonly.clh
2370
-- Installing: /home/jenkins/workspace/Matrix_OnDemand/80361d7e/test-install/share/gromacs/opencl/gromacs/nbnxm/opencl/nbnxm_ocl_kernel_utils.clh
2371
-- Installing: /home/jenkins/workspace/Matrix_OnDemand/80361d7e/test-install/share/gromacs/opencl/gromacs/nbnxm/opencl/nbnxm_ocl_kernels.cl
2372
-- Installing: /home/jenkins/workspace/Matrix_OnDemand/80361d7e/test-install/share/gromacs/opencl/gromacs/nbnxm/opencl/nbnxm_ocl_kernels.clh
2373
-- Installing: /home/jenkins/workspace/Matrix_OnDemand/80361d7e/test-install/share/gromacs/opencl/gromacs/nbnxm/opencl/nbnxm_ocl_kernels_fastgen.clh
2374
-- Installing: /home/jenkins/workspace/Matrix_OnDemand/80361d7e/test-install/share/gromacs/opencl/gromacs/nbnxm/opencl/nbnxm_ocl_kernels_fastgen_add_twincut.clh
2375
-- Installing: /home/jenkins/workspace/Matrix_OnDemand/80361d7e/test-install/share/gromacs/opencl/gromacs/ewald/pme_gather.clh
2376
-- Installing: /home/jenkins/workspace/Matrix_OnDemand/80361d7e/test-install/share/gromacs/opencl/gromacs/ewald/pme_gpu_types.h
2377
-- Installing: /home/jenkins/workspace/Matrix_OnDemand/80361d7e/test-install/share/gromacs/opencl/gromacs/ewald/pme_gpu_utils.clh
2378
-- Installing: /home/jenkins/workspace/Matrix_OnDemand/80361d7e/test-install/share/gromacs/opencl/gromacs/ewald/pme_program.cl
2379
-- Installing: /home/jenkins/workspace/Matrix_OnDemand/80361d7e/test-install/share/gromacs/opencl/gromacs/ewald/pme_solve.clh
2380
-- Installing: /home/jenkins/workspace/Matrix_OnDemand/80361d7e/test-install/share/gromacs/opencl/gromacs/ewald/pme_spread.clh
2381
-- Installing: /home/jenkins/workspace/Matrix_OnDemand/80361d7e/test-install/include/gromacs/utility/basedefinitions.h
2382
-- Installing: /home/jenkins/workspace/Matrix_OnDemand/80361d7e/test-install/include/gromacs/utility/current_function.h
2383
-- Installing: /home/jenkins/workspace/Matrix_OnDemand/80361d7e/test-install/include/gromacs/utility/gmxassert.h
2384
-- Installing: /home/jenkins/workspace/Matrix_OnDemand/80361d7e/test-install/include/gromacs/utility/real.h
2385
-- Installing: /home/jenkins/workspace/Matrix_OnDemand/80361d7e/test-install/include/gromacs/math/vectypes.h
2386
-- Installing: /home/jenkins/workspace/Matrix_OnDemand/80361d7e/test-install/include/gromacs/restraint/restraintpotential.h
2387
-- Installing: /home/jenkins/workspace/Matrix_OnDemand/80361d7e/test-install/bin/gmx
2388
-- Up-to-date: /home/jenkins/workspace/Matrix_OnDemand/80361d7e/test-install/bin
2389
-- Installing: /home/jenkins/workspace/Matrix_OnDemand/80361d7e/test-install/bin/gmx-completion.bash
2390
-- Installing: /home/jenkins/workspace/Matrix_OnDemand/80361d7e/test-install/bin/gmx-completion-gmx.bash
2391
-- Installing: /home/jenkins/workspace/Matrix_OnDemand/80361d7e/test-install/include/gmxapi
2392
-- Installing: /home/jenkins/workspace/Matrix_OnDemand/80361d7e/test-install/include/gmxapi/session.h
2393
-- Installing: /home/jenkins/workspace/Matrix_OnDemand/80361d7e/test-install/include/gmxapi/compat
2394
-- Installing: /home/jenkins/workspace/Matrix_OnDemand/80361d7e/test-install/include/gmxapi/compat/tpr.h
2395
-- Installing: /home/jenkins/workspace/Matrix_OnDemand/80361d7e/test-install/include/gmxapi/compat/mdparams.h
2396
-- Installing: /home/jenkins/workspace/Matrix_OnDemand/80361d7e/test-install/include/gmxapi/gmxapicompat.h
2397
-- Installing: /home/jenkins/workspace/Matrix_OnDemand/80361d7e/test-install/include/gmxapi/status.h
2398
-- Installing: /home/jenkins/workspace/Matrix_OnDemand/80361d7e/test-install/include/gmxapi/session
2399
-- Installing: /home/jenkins/workspace/Matrix_OnDemand/80361d7e/test-install/include/gmxapi/session/resources.h
2400
-- Installing: /home/jenkins/workspace/Matrix_OnDemand/80361d7e/test-install/include/gmxapi/context.h
2401
-- Installing: /home/jenkins/workspace/Matrix_OnDemand/80361d7e/test-install/include/gmxapi/system.h
2402
-- Installing: /home/jenkins/workspace/Matrix_OnDemand/80361d7e/test-install/include/gmxapi/version.h
2403
-- Installing: /home/jenkins/workspace/Matrix_OnDemand/80361d7e/test-install/include/gmxapi/gromacsfwd.h
2404
-- Installing: /home/jenkins/workspace/Matrix_OnDemand/80361d7e/test-install/include/gmxapi/exceptions.h
2405
-- Installing: /home/jenkins/workspace/Matrix_OnDemand/80361d7e/test-install/include/gmxapi/md.h
2406
-- Installing: /home/jenkins/workspace/Matrix_OnDemand/80361d7e/test-install/include/gmxapi/gmxapi.h
2407
-- Installing: /home/jenkins/workspace/Matrix_OnDemand/80361d7e/test-install/include/gmxapi/md
2408
-- Installing: /home/jenkins/workspace/Matrix_OnDemand/80361d7e/test-install/include/gmxapi/md/mdsignals.h
2409
-- Installing: /home/jenkins/workspace/Matrix_OnDemand/80361d7e/test-install/include/gmxapi/md/mdmodule.h
2410
-- Up-to-date: /home/jenkins/workspace/Matrix_OnDemand/80361d7e/test-install/include/gmxapi/version.h
2411
-- Installing: /home/jenkins/workspace/Matrix_OnDemand/80361d7e/test-install/lib/libgmxapi.so.0.1.0
2412
-- Installing: /home/jenkins/workspace/Matrix_OnDemand/80361d7e/test-install/lib/libgmxapi.so.0
2413
-- Installing: /home/jenkins/workspace/Matrix_OnDemand/80361d7e/test-install/lib/libgmxapi.so
2414
-- Installing: /home/jenkins/workspace/Matrix_OnDemand/80361d7e/test-install/share/cmake/gmxapi/gmxapi.cmake
2415
-- Installing: /home/jenkins/workspace/Matrix_OnDemand/80361d7e/test-install/share/cmake/gmxapi/gmxapi-debug.cmake
2416
-- Installing: /home/jenkins/workspace/Matrix_OnDemand/80361d7e/test-install/share/cmake/gmxapi/gmxapi-config-version.cmake
2417
-- Installing: /home/jenkins/workspace/Matrix_OnDemand/80361d7e/test-install/share/cmake/gmxapi/gmxapi-config.cmake
2418
+ /opt/cmake/3.14.5/bin/cmake --build . --target ocl_nbnxm_kernels -- -j8
2419
Scanning dependencies of target ocl_nbnxm_kernels
2420
[  0%] Generating nbnxm_ocl_kernel_ElecCut_VdwLJ_AMD.o
2421
[  0%] Generating nbnxm_ocl_kernel_ElecCut_VdwLJCombGeom_AMD.o
2422
[  0%] Generating nbnxm_ocl_kernel_ElecCut_VdwLJ_NVIDIA.o
2423
[  0%] Generating nbnxm_ocl_kernel_ElecCut_VdwLJCombLB_NVIDIA.o
2424
[ 11%] Generating nbnxm_ocl_kernel_ElecCut_VdwLJCombLB_AMD.o
2425
[ 11%] Generating nbnxm_ocl_kernel_ElecCut_VdwLJCombGeom_NVIDIA.o
2426
[ 11%] Generating nbnxm_ocl_kernel_ElecCut_VdwLJCombGeom_INTEL.o
2427
[ 11%] Generating nbnxm_ocl_kernel_ElecCut_VdwLJ_INTEL.o
2428
40 warnings generated.
2429
[ 11%] Generating nbnxm_ocl_kernel_ElecCut_VdwLJCombLB_INTEL.o
2430
40 warnings generated.
2431
[ 11%] Generating nbnxm_ocl_kernel_ElecCut_VdwLJFsw_AMD.o
2432
40 warnings generated.
2433
[ 11%] Generating nbnxm_ocl_kernel_ElecCut_VdwLJFsw_NVIDIA.o
2434
40 warnings generated.
2435
[ 11%] Generating nbnxm_ocl_kernel_ElecCut_VdwLJFsw_INTEL.o
2436
40 warnings generated.
2437
[ 11%] Generating nbnxm_ocl_kernel_ElecCut_VdwLJPsw_AMD.o
2438
40 warnings generated.
2439
[ 11%] Generating nbnxm_ocl_kernel_ElecCut_VdwLJPsw_NVIDIA.o
2440
40 warnings generated.
2441
[ 11%] Generating nbnxm_ocl_kernel_ElecCut_VdwLJPsw_INTEL.o
2442
40 warnings generated.
2443
[ 11%] Generating nbnxm_ocl_kernel_ElecCut_VdwLJEwCombGeom_AMD.o
2444
40 warnings generated.
2445
[ 11%] Generating nbnxm_ocl_kernel_ElecCut_VdwLJEwCombGeom_NVIDIA.o
2446
40 warnings generated.
2447
40 warnings generated.
2448
40 warnings generated.
2449
[ 11%] Generating nbnxm_ocl_kernel_ElecCut_VdwLJEwCombLB_AMD.o
2450
[ 11%] Generating nbnxm_ocl_kernel_ElecCut_VdwLJEwCombLB_NVIDIA.o
2451
[ 11%] Generating nbnxm_ocl_kernel_ElecCut_VdwLJEwCombGeom_INTEL.o
2452
40 warnings generated.
2453
[ 22%] Generating nbnxm_ocl_kernel_ElecCut_VdwLJEwCombLB_INTEL.o
2454
40 warnings generated.
2455
[ 22%] Generating nbnxm_ocl_kernel_ElecRF_VdwLJ_AMD.o
2456
40 warnings generated.
2457
[ 22%] Generating nbnxm_ocl_kernel_ElecRF_VdwLJ_NVIDIA.o
2458
40 warnings generated.
2459
[ 22%] Generating nbnxm_ocl_kernel_ElecRF_VdwLJ_INTEL.o
2460
40 warnings generated.
2461
[ 22%] Generating nbnxm_ocl_kernel_ElecRF_VdwLJCombGeom_AMD.o
2462
40 warnings generated.
2463
40 warnings generated.
2464
[ 22%] Generating nbnxm_ocl_kernel_ElecRF_VdwLJCombGeom_NVIDIA.o
2465
[ 22%] Generating nbnxm_ocl_kernel_ElecRF_VdwLJCombGeom_INTEL.o
2466
40 warnings generated.
2467
[ 22%] Generating nbnxm_ocl_kernel_ElecRF_VdwLJCombLB_AMD.o
2468
40 warnings generated.
2469
[ 22%] Generating nbnxm_ocl_kernel_ElecRF_VdwLJCombLB_NVIDIA.o
2470
40 warnings generated.
2471
40 warnings generated.
2472
[ 22%] Generating nbnxm_ocl_kernel_ElecRF_VdwLJCombLB_INTEL.o
2473
[ 22%] Generating nbnxm_ocl_kernel_ElecRF_VdwLJFsw_AMD.o
2474
40 warnings generated.
2475
[ 22%] Generating nbnxm_ocl_kernel_ElecRF_VdwLJFsw_NVIDIA.o
2476
40 warnings generated.
2477
[ 22%] Generating nbnxm_ocl_kernel_ElecRF_VdwLJFsw_INTEL.o
2478
40 warnings generated.
2479
[ 22%] Generating nbnxm_ocl_kernel_ElecRF_VdwLJPsw_AMD.o
2480
40 warnings generated.
2481
[ 22%] Generating nbnxm_ocl_kernel_ElecRF_VdwLJPsw_NVIDIA.o
2482
40 warnings generated.
2483
[ 33%] Generating nbnxm_ocl_kernel_ElecRF_VdwLJPsw_INTEL.o
2484
40 warnings generated.
2485
[ 33%] Generating nbnxm_ocl_kernel_ElecRF_VdwLJEwCombGeom_AMD.o
2486
40 warnings generated.
2487
[ 33%] Generating nbnxm_ocl_kernel_ElecRF_VdwLJEwCombGeom_NVIDIA.o
2488
40 warnings generated.
2489
[ 33%] Generating nbnxm_ocl_kernel_ElecRF_VdwLJEwCombGeom_INTEL.o
2490
40 warnings generated.
2491
[ 33%] Generating nbnxm_ocl_kernel_ElecRF_VdwLJEwCombLB_AMD.o
2492
40 warnings generated.
2493
[ 33%] Generating nbnxm_ocl_kernel_ElecRF_VdwLJEwCombLB_NVIDIA.o
2494
40 warnings generated.
2495
[ 33%] Generating nbnxm_ocl_kernel_ElecRF_VdwLJEwCombLB_INTEL.o
2496
40 warnings generated.
2497
[ 33%] Generating nbnxm_ocl_kernel_ElecEwQSTab_VdwLJ_AMD.o
2498
40 warnings generated.
2499
[ 33%] Generating nbnxm_ocl_kernel_ElecEwQSTab_VdwLJ_NVIDIA.o
2500
40 warnings generated.
2501
[ 33%] Generating nbnxm_ocl_kernel_ElecEwQSTab_VdwLJ_INTEL.o
2502
40 warnings generated.
2503
[ 33%] Generating nbnxm_ocl_kernel_ElecEwQSTab_VdwLJCombGeom_AMD.o
2504
40 warnings generated.
2505
[ 33%] Generating nbnxm_ocl_kernel_ElecEwQSTab_VdwLJCombGeom_NVIDIA.o
2506
40 warnings generated.
2507
[ 33%] Generating nbnxm_ocl_kernel_ElecEwQSTab_VdwLJCombGeom_INTEL.o
2508
40 warnings generated.
2509
[ 33%] Generating nbnxm_ocl_kernel_ElecEwQSTab_VdwLJCombLB_AMD.o
2510
40 warnings generated.
2511
[ 44%] Generating nbnxm_ocl_kernel_ElecEwQSTab_VdwLJCombLB_NVIDIA.o
2512
40 warnings generated.
2513
[ 44%] Generating nbnxm_ocl_kernel_ElecEwQSTab_VdwLJCombLB_INTEL.o
2514
40 warnings generated.
2515
[ 44%] Generating nbnxm_ocl_kernel_ElecEwQSTab_VdwLJFsw_AMD.o
2516
40 warnings generated.
2517
[ 44%] Generating nbnxm_ocl_kernel_ElecEwQSTab_VdwLJFsw_NVIDIA.o
2518
40 warnings generated.
2519
[ 44%] Generating nbnxm_ocl_kernel_ElecEwQSTab_VdwLJFsw_INTEL.o
2520
40 warnings generated.
2521
[ 44%] Generating nbnxm_ocl_kernel_ElecEwQSTab_VdwLJPsw_AMD.o
2522
40 warnings generated.
2523
[ 44%] Generating nbnxm_ocl_kernel_ElecEwQSTab_VdwLJPsw_NVIDIA.o
2524
40 warnings generated.
2525
[ 44%] Generating nbnxm_ocl_kernel_ElecEwQSTab_VdwLJPsw_INTEL.o
2526
40 warnings generated.
2527
[ 44%] Generating nbnxm_ocl_kernel_ElecEwQSTab_VdwLJEwCombGeom_AMD.o
2528
40 warnings generated.
2529
[ 44%] Generating nbnxm_ocl_kernel_ElecEwQSTab_VdwLJEwCombGeom_NVIDIA.o
2530
40 warnings generated.
2531
[ 44%] Generating nbnxm_ocl_kernel_ElecEwQSTab_VdwLJEwCombGeom_INTEL.o
2532
40 warnings generated.
2533
[ 44%] Generating nbnxm_ocl_kernel_ElecEwQSTab_VdwLJEwCombLB_AMD.o
2534
40 warnings generated.
2535
[ 44%] Generating nbnxm_ocl_kernel_ElecEwQSTab_VdwLJEwCombLB_NVIDIA.o
2536
40 warnings generated.
2537
[ 44%] Generating nbnxm_ocl_kernel_ElecEwQSTab_VdwLJEwCombLB_INTEL.o
2538
40 warnings generated.
2539
[ 44%] Generating nbnxm_ocl_kernel_ElecEwQSTabTwinCut_VdwLJ_AMD.o
2540
40 warnings generated.
2541
[ 55%] Generating nbnxm_ocl_kernel_ElecEwQSTabTwinCut_VdwLJ_NVIDIA.o
2542
40 warnings generated.
2543
[ 55%] Generating nbnxm_ocl_kernel_ElecEwQSTabTwinCut_VdwLJ_INTEL.o
2544
40 warnings generated.
2545
[ 55%] Generating nbnxm_ocl_kernel_ElecEwQSTabTwinCut_VdwLJCombGeom_AMD.o
2546
40 warnings generated.
2547
[ 55%] Generating nbnxm_ocl_kernel_ElecEwQSTabTwinCut_VdwLJCombGeom_NVIDIA.o
2548
40 warnings generated.
2549
[ 55%] Generating nbnxm_ocl_kernel_ElecEwQSTabTwinCut_VdwLJCombGeom_INTEL.o
2550
40 warnings generated.
2551
[ 55%] Generating nbnxm_ocl_kernel_ElecEwQSTabTwinCut_VdwLJCombLB_AMD.o
2552
40 warnings generated.
2553
[ 55%] Generating nbnxm_ocl_kernel_ElecEwQSTabTwinCut_VdwLJCombLB_NVIDIA.o
2554
40 warnings generated.
2555
[ 55%] Generating nbnxm_ocl_kernel_ElecEwQSTabTwinCut_VdwLJCombLB_INTEL.o
2556
40 warnings generated.
2557
[ 55%] Generating nbnxm_ocl_kernel_ElecEwQSTabTwinCut_VdwLJFsw_AMD.o
2558
40 warnings generated.
2559
[ 55%] Generating nbnxm_ocl_kernel_ElecEwQSTabTwinCut_VdwLJFsw_NVIDIA.o
2560
40 warnings generated.
2561
[ 55%] Generating nbnxm_ocl_kernel_ElecEwQSTabTwinCut_VdwLJFsw_INTEL.o
2562
40 warnings generated.
2563
[ 55%] Generating nbnxm_ocl_kernel_ElecEwQSTabTwinCut_VdwLJPsw_AMD.o
2564
40 warnings generated.
2565
[ 55%] Generating nbnxm_ocl_kernel_ElecEwQSTabTwinCut_VdwLJPsw_NVIDIA.o
2566
40 warnings generated.
2567
[ 55%] Generating nbnxm_ocl_kernel_ElecEwQSTabTwinCut_VdwLJPsw_INTEL.o
2568
40 warnings generated.
2569
[ 66%] Generating nbnxm_ocl_kernel_ElecEwQSTabTwinCut_VdwLJEwCombGeom_AMD.o
2570
40 warnings generated.
2571
[ 66%] Generating nbnxm_ocl_kernel_ElecEwQSTabTwinCut_VdwLJEwCombGeom_NVIDIA.o
2572
40 warnings generated.
2573
[ 66%] Generating nbnxm_ocl_kernel_ElecEwQSTabTwinCut_VdwLJEwCombGeom_INTEL.o
2574
40 warnings generated.
2575
[ 66%] Generating nbnxm_ocl_kernel_ElecEwQSTabTwinCut_VdwLJEwCombLB_AMD.o
2576
40 warnings generated.
2577
[ 66%] Generating nbnxm_ocl_kernel_ElecEwQSTabTwinCut_VdwLJEwCombLB_NVIDIA.o
2578
40 warnings generated.
2579
[ 66%] Generating nbnxm_ocl_kernel_ElecEwQSTabTwinCut_VdwLJEwCombLB_INTEL.o
2580
40 warnings generated.
2581
[ 66%] Generating nbnxm_ocl_kernel_ElecEw_VdwLJ_AMD.o
2582
40 warnings generated.
2583
40 warnings generated.
2584
[ 66%] Generating nbnxm_ocl_kernel_ElecEw_VdwLJ_INTEL.o
2585
[ 66%] Generating nbnxm_ocl_kernel_ElecEw_VdwLJ_NVIDIA.o
2586
40 warnings generated.
2587
[ 66%] Generating nbnxm_ocl_kernel_ElecEw_VdwLJCombGeom_AMD.o
2588
40 warnings generated.
2589
[ 66%] Generating nbnxm_ocl_kernel_ElecEw_VdwLJCombGeom_NVIDIA.o
2590
40 warnings generated.
2591
[ 66%] Generating nbnxm_ocl_kernel_ElecEw_VdwLJCombGeom_INTEL.o
2592
40 warnings generated.
2593
[ 66%] Generating nbnxm_ocl_kernel_ElecEw_VdwLJCombLB_AMD.o
2594
40 warnings generated.
2595
40 warnings generated.
2596
[ 66%] Generating nbnxm_ocl_kernel_ElecEw_VdwLJCombLB_NVIDIA.o
2597
40 warnings generated.
2598
[ 66%] Generating nbnxm_ocl_kernel_ElecEw_VdwLJCombLB_INTEL.o
2599
40 warnings generated.
2600
[ 77%] Generating nbnxm_ocl_kernel_ElecEw_VdwLJFsw_AMD.o
2601
[ 77%] Generating nbnxm_ocl_kernel_ElecEw_VdwLJFsw_NVIDIA.o
2602
40 warnings generated.
2603
[ 77%] Generating nbnxm_ocl_kernel_ElecEw_VdwLJFsw_INTEL.o
2604
40 warnings generated.
2605
[ 77%] Generating nbnxm_ocl_kernel_ElecEw_VdwLJPsw_AMD.o
2606
40 warnings generated.
2607
[ 77%] Generating nbnxm_ocl_kernel_ElecEw_VdwLJPsw_NVIDIA.o
2608
40 warnings generated.
2609
40 warnings generated.
2610
[ 77%] Generating nbnxm_ocl_kernel_ElecEw_VdwLJEwCombGeom_AMD.o
2611
[ 77%] Generating nbnxm_ocl_kernel_ElecEw_VdwLJPsw_INTEL.o
2612
40 warnings generated.
2613
[ 77%] Generating nbnxm_ocl_kernel_ElecEw_VdwLJEwCombGeom_NVIDIA.o
2614
40 warnings generated.
2615
[ 77%] Generating nbnxm_ocl_kernel_ElecEw_VdwLJEwCombGeom_INTEL.o
2616
40 warnings generated.
2617
[ 77%] Generating nbnxm_ocl_kernel_ElecEw_VdwLJEwCombLB_AMD.o
2618
40 warnings generated.
2619
[ 77%] Generating nbnxm_ocl_kernel_ElecEw_VdwLJEwCombLB_NVIDIA.o
2620
40 warnings generated.
2621
[ 77%] Generating nbnxm_ocl_kernel_ElecEw_VdwLJEwCombLB_INTEL.o
2622
40 warnings generated.
2623
40 warnings generated.
2624
[ 77%] Generating nbnxm_ocl_kernel_ElecEwTwinCut_VdwLJ_AMD.o
2625
[ 77%] Generating nbnxm_ocl_kernel_ElecEwTwinCut_VdwLJ_NVIDIA.o
2626
40 warnings generated.
2627
[ 88%] Generating nbnxm_ocl_kernel_ElecEwTwinCut_VdwLJ_INTEL.o
2628
40 warnings generated.
2629
[ 88%] Generating nbnxm_ocl_kernel_ElecEwTwinCut_VdwLJCombGeom_AMD.o
2630
40 warnings generated.
2631
[ 88%] Generating nbnxm_ocl_kernel_ElecEwTwinCut_VdwLJCombGeom_NVIDIA.o
2632
40 warnings generated.
2633
[ 88%] Generating nbnxm_ocl_kernel_ElecEwTwinCut_VdwLJCombGeom_INTEL.o
2634
40 warnings generated.
2635
[ 88%] Generating nbnxm_ocl_kernel_ElecEwTwinCut_VdwLJCombLB_AMD.o
2636
40 warnings generated.
2637
[ 88%] Generating nbnxm_ocl_kernel_ElecEwTwinCut_VdwLJCombLB_NVIDIA.o
2638
40 warnings generated.
2639
[ 88%] Generating nbnxm_ocl_kernel_ElecEwTwinCut_VdwLJCombLB_INTEL.o
2640
40 warnings generated.
2641
40 warnings generated.
2642
[ 88%] Generating nbnxm_ocl_kernel_ElecEwTwinCut_VdwLJFsw_AMD.o
2643
[ 88%] Generating nbnxm_ocl_kernel_ElecEwTwinCut_VdwLJFsw_NVIDIA.o
2644
40 warnings generated.
2645
[ 88%] Generating nbnxm_ocl_kernel_ElecEwTwinCut_VdwLJFsw_INTEL.o
2646
40 warnings generated.
2647
[ 88%] Generating nbnxm_ocl_kernel_ElecEwTwinCut_VdwLJPsw_AMD.o
2648
40 warnings generated.
2649
[ 88%] Generating nbnxm_ocl_kernel_ElecEwTwinCut_VdwLJPsw_NVIDIA.o
2650
40 warnings generated.
2651
[ 88%] Generating nbnxm_ocl_kernel_ElecEwTwinCut_VdwLJPsw_INTEL.o
2652
40 warnings generated.
2653
[ 88%] Generating nbnxm_ocl_kernel_ElecEwTwinCut_VdwLJEwCombGeom_AMD.o
2654
40 warnings generated.
2655
[100%] Generating nbnxm_ocl_kernel_ElecEwTwinCut_VdwLJEwCombGeom_NVIDIA.o
2656
40 warnings generated.
2657
[100%] Generating nbnxm_ocl_kernel_ElecEwTwinCut_VdwLJEwCombGeom_INTEL.o
2658
40 warnings generated.
2659
[100%] Generating nbnxm_ocl_kernel_ElecEwTwinCut_VdwLJEwCombLB_AMD.o
2660
40 warnings generated.
2661
[100%] Generating nbnxm_ocl_kernel_ElecEwTwinCut_VdwLJEwCombLB_NVIDIA.o
2662
40 warnings generated.
2663
[100%] Generating nbnxm_ocl_kernel_ElecEwTwinCut_VdwLJEwCombLB_INTEL.o
2664
40 warnings generated.
2665
40 warnings generated.
2666
40 warnings generated.
2667
40 warnings generated.
2668
40 warnings generated.
2669
40 warnings generated.
2670
40 warnings generated.
2671
40 warnings generated.
2672
[100%] Built target ocl_nbnxm_kernels
2673
+ perl gmxtest.pl -mpirun mpirun -xml -nosuffix all -nt 2
2674
Will test on 2 thread-MPI ranks (if possible)
2675
Unknown Error: box[    0] ( 2.35480e+00  0.00000e+00  0.00000e+00) - ( 2.34774e+00  0.00000e+00  0.00000e+00)
2676
!
2677
Unknown Error: box[    1] ( 0.00000e+00  2.35480e+00  0.00000e+00) - ( 0.00000e+00  2.34774e+00  0.00000e+00)
2678
!
2679
Unknown Error: box[    2] ( 1.17740e+00  1.17740e+00  1.66509e+00) - ( 1.17387e+00  1.17387e+00  1.66010e+00)
2680
!
2681
FAILED. Check checkpot.out (9 errors), checkforce.out (949 errors) file(s) in nbnxn_vsite for nbnxn_vsite
2682
Re-running orientation-restraints using CPU-based PME
2683
1 out of 49 complex tests FAILED
2684
All 10 freeenergy tests PASSED
2685
All 12 rotation tests PASSED
2686
All 0 extra tests PASSED
2687
All 7 essential dynamics tests PASSED
2688
(exited with code 1)
2689
Traceback (most recent call last):
2690
  File "/mnt/workspace/Matrix_OnDemand/80361d7e/releng/releng/__init__.py", line 46, in run_build
2691
    BuildContext._run_build(factory, build, job_type, opts)
2692
  File "/mnt/workspace/Matrix_OnDemand/80361d7e/releng/releng/context.py", line 458, in _run_build
2693
    script.do_build(context, factory.cwd)
2694
  File "/mnt/workspace/Matrix_OnDemand/80361d7e/releng/releng/script.py", line 102, in do_build
2695
    self._do_build(context)
2696
  File "/home/jenkins/workspace/Matrix_OnDemand/80361d7e/gromacs/admin/builds/gromacs.py", line 298, in do_build
2697
    context.run_cmd(cmd, shell=True, failure_message='Regression tests failed to execute')
2698
  File "/mnt/workspace/Matrix_OnDemand/80361d7e/releng/releng/context.py", line 102, in run_cmd
2699
    raise BuildError(failure_message)
2700
BuildError: Regression tests failed to execute
2701
Build FAILED:
2702
  Regression tests failed to execute
2703
Build step 'Execute Python script' marked build as failure
2704
[WARNINGS] Parsing warnings in console log with parser Intel C Compiler
2705
No credentials specified
2706
<Git Blamer> Using GitBlamer to create author and commit information for all warnings.
2707
<Git Blamer> GIT_COMMIT=a6e23ca5da50c0cd802be032a084d254f4b2bfc2, workspace=/home/jenkins/workspace/Matrix_OnDemand/80361d7e/gromacs
2708
[WARNINGS] Parsing warnings in console log with parser MSBuild
2709
No credentials specified
2710
<Git Blamer> Using GitBlamer to create author and commit information for all warnings.
2711
<Git Blamer> GIT_COMMIT=a6e23ca5da50c0cd802be032a084d254f4b2bfc2, workspace=/home/jenkins/workspace/Matrix_OnDemand/80361d7e/gromacs
2712
[WARNINGS] Parsing warnings in console log with parser GNU C Compiler 4 (gcc)
2713
No credentials specified
2714
<Git Blamer> Using GitBlamer to create author and commit information for all warnings.
2715
<Git Blamer> GIT_COMMIT=a6e23ca5da50c0cd802be032a084d254f4b2bfc2, workspace=/home/jenkins/workspace/Matrix_OnDemand/80361d7e/gromacs
2716
[WARNINGS] Parsing warnings in console log with parser CMake
2717
No credentials specified
2718
<Git Blamer> Using GitBlamer to create author and commit information for all warnings.
2719
<Git Blamer> GIT_COMMIT=a6e23ca5da50c0cd802be032a084d254f4b2bfc2, workspace=/home/jenkins/workspace/Matrix_OnDemand/80361d7e/gromacs
2720
[WARNINGS] Parsing warnings in console log with parser NVIDIA CUDA compiler
2721
No credentials specified
2722
<Git Blamer> Using GitBlamer to create author and commit information for all warnings.
2723
<Git Blamer> GIT_COMMIT=a6e23ca5da50c0cd802be032a084d254f4b2bfc2, workspace=/home/jenkins/workspace/Matrix_OnDemand/80361d7e/gromacs
2724
[WARNINGS] Parsing warnings in console log with parser Clang (LLVM based)
2725
No credentials specified
2726
<Git Blamer> Using GitBlamer to create author and commit information for all warnings.
2727
<Git Blamer> GIT_COMMIT=a6e23ca5da50c0cd802be032a084d254f4b2bfc2, workspace=/home/jenkins/workspace/Matrix_OnDemand/80361d7e/gromacs
2728
[WARNINGS] Computing warning deltas based on reference build #2220
2729
[WARNINGS] Ignore new warnings since this is the first valid build
2730
[WARNINGS] Plug-in Result: Success - no threshold has been exceeded
2731
Archiving artifacts
2732
[TextFinder plugin] Scanning console output...
2733
/var/lib/jenkins/jobs/Matrix_OnDemand/configurations/axis-OPTIONS/clang-8%20simd=avx2_256%20opencl-1.2%20cmake-3.14.5%20tidy%20host=bs_gpu01/axis-label/bs_gpu01/builds/2245/log:
2734
FAILED. Check checkpot.out (9 errors), checkforce.out (949 errors) file(s) in nbnxn_vsite for nbnxn_vsite
2735
[TextFinder plugin] Finished looking for pattern 'FAILED|This means you are not really testing' in the console output
2736
Performing Post build task...
2737
Match found for :. : True
2738
Logical operation result is TRUE
2739
Running script  : del .git\index.lock   || rm -f .git/index.lock
2740
[80361d7e] $ /bin/sh -xe /tmp/jenkins7939527812714341335.sh
2741
+ del .gitindex.lock
2742
/tmp/jenkins7939527812714341335.sh: 2: /tmp/jenkins7939527812714341335.sh: del: not found
2743
+ rm -f .git/index.lock
2744
POST BUILD TASK : SUCCESS
2745
END OF POST BUILD TASK : 0
2746
Recording test results
2747
Notifying upstream projects of job completion
2748
Finished: FAILURE