Project

General

Profile

Bug #1015

Updated by Mark Abraham almost 7 years ago

Make install mdrun broken on release-4.6 target
<pre>alexxy@x201 alexxy@x201 ~/Src/gromacs_build $ LANG=C make install-mdrun
[ 0%] Generating version information
[ 0%] Built target gmx_version
[ 80%] Built target gmx
[ 91%] Built target md
[ 95%] Built target gmxpreprocess
[ 98%] Built target mdrun
[100%] Installing mdrun
-- Install configuration: "Release"
-- Install component: "libraries"
-- Up-to-date: /tmp/gromacs/lib/libgmx.so.6
-- Up-to-date: /tmp/gromacs/lib/libgmx.so
-- Up-to-date: /tmp/gromacs/lib/libmd.so.6
-- Up-to-date: /tmp/gromacs/lib/libmd.so
-- Up-to-date: /tmp/gromacs/lib/libgmxpreprocess.so.6
-- Up-to-date: /tmp/gromacs/lib/libgmxpreprocess.so
CMake Error at /home/alexxy/Src/gromacs_build/src/tools/cmake_install.cmake:3523 (FILE):
file INSTALL cannot find
"/home/alexxy/Src/gromacs_build/src/tools/libgmxana.so.6".
Call Stack (most recent call first):
/home/alexxy/Src/gromacs_build/src/cmake_install.cmake:52 (INCLUDE)
/home/alexxy/Src/gromacs_build/cmake_install.cmake:39 (INCLUDE)

make[3]: *** [src/kernel/CMakeFiles/install-mdrun] Error 1
make[2]: *** [src/kernel/CMakeFiles/install-mdrun.dir/all] Error 2
make[1]: *** [src/kernel/CMakeFiles/install-mdrun.dir/rule] Error 2
make: *** [install-mdrun] Error 2
</pre>

Back