Project

General

Profile

CMakeError.txt

James Ostrander, 01/26/2017 07:42 PM

 
1
Performing C++ SOURCE FILE Test CXXFLAGS_LANG failed with the following output:
2
Change Dir: /home/u0017592/projects/gromacs/build/CMakeFiles/CMakeTmp
3

    
4
Run Build Command:"/usr/bin/gmake" "cmTC_219a9/fast"
5
/usr/bin/gmake -f CMakeFiles/cmTC_219a9.dir/build.make CMakeFiles/cmTC_219a9.dir/build
6
gmake[1]: Entering directory `/home/u0017592/projects/gromacs/build/CMakeFiles/CMakeTmp'
7
Building CXX object CMakeFiles/cmTC_219a9.dir/src.cxx.o
8
/usr/bin/xlC  -+   -qthreaded -qhalt=e -std=c++11  -DCXXFLAGS_LANG -qsuppress=1500-036 -qsuppress=1500-010 -qsuppress=1500-030   -o CMakeFiles/cmTC_219a9.dir/src.cxx.o -c /home/u0017592/projects/gromacs/build/CMakeFiles/CMakeTmp/src.cxx
9
warning: 1540-5203 Unrecognized value "e" specified with option "halt".
10
warning: 1540-5200 The option "-qsuppress=1500-036" is not supported.
11
warning: 1540-5200 The option "-qsuppress=1500-010" is not supported.
12
warning: 1540-5200 The option "-qsuppress=1500-030" is not supported.
13
4 warnings generated.
14
Linking CXX executable cmTC_219a9
15
/usr/bin/cmake3 -E cmake_link_script CMakeFiles/cmTC_219a9.dir/link.txt --verbose=1
16
/usr/bin/xlC    -qthreaded -qhalt=e -std=c++11  -DCXXFLAGS_LANG -qsuppress=1500-036 -qsuppress=1500-010 -qsuppress=1500-030    CMakeFiles/cmTC_219a9.dir/src.cxx.o  -o cmTC_219a9 
17
gmake[1]: Leaving directory `/home/u0017592/projects/gromacs/build/CMakeFiles/CMakeTmp'
18

    
19
Source file was:
20
int main() { return 0;}
21
Determining if files io.h exist failed with the following output:
22
Change Dir: /home/u0017592/projects/gromacs/build/CMakeFiles/CMakeTmp
23

    
24
Run Build Command:"/usr/bin/gmake" "cmTC_ed362/fast"
25
/usr/bin/gmake -f CMakeFiles/cmTC_ed362.dir/build.make CMakeFiles/cmTC_ed362.dir/build
26
gmake[1]: Entering directory `/home/u0017592/projects/gromacs/build/CMakeFiles/CMakeTmp'
27
Building C object CMakeFiles/cmTC_ed362.dir/CheckIncludeFiles.c.o
28
/usr/bin/xlc    -qthreaded -qhalt=e -qsuppress=1500-036 -qsuppress=1500-010 -qsuppress=1500-030 -qlanglvl=extc99 -qarch=auto -qtune=auto     -o CMakeFiles/cmTC_ed362.dir/CheckIncludeFiles.c.o   -c /home/u0017592/projects/gromacs/build/CMakeFiles/CMakeTmp/CheckIncludeFiles.c
29
warning: 1540-5203 Unrecognized value "e" specified with option "halt".
30
warning: 1540-5200 The option "-qsuppress=1500-036" is not supported.
31
warning: 1540-5200 The option "-qsuppress=1500-010" is not supported.
32
warning: 1540-5200 The option "-qsuppress=1500-030" is not supported.
33
/home/u0017592/projects/gromacs/build/CMakeFiles/CMakeTmp/CheckIncludeFiles.c:2:10: fatal error: 'io.h' file not found
34
#include <io.h>
35
         ^
36
4 warnings and 1 error generated.
37
Error while processing /home/u0017592/projects/gromacs/build/CMakeFiles/CMakeTmp/CheckIncludeFiles.c.
38
gmake[1]: *** [CMakeFiles/cmTC_ed362.dir/CheckIncludeFiles.c.o] Error 1
39
gmake[1]: Leaving directory `/home/u0017592/projects/gromacs/build/CMakeFiles/CMakeTmp'
40
gmake: *** [cmTC_ed362/fast] Error 2
41

    
42
Source:
43
/* */
44
#include <io.h>
45

    
46

    
47
int main(void){return 0;}
48

    
49
Determining if the _fileno exist failed with the following output:
50
Change Dir: /home/u0017592/projects/gromacs/build/CMakeFiles/CMakeTmp
51

    
52
Run Build Command:"/usr/bin/gmake" "cmTC_85545/fast"
53
/usr/bin/gmake -f CMakeFiles/cmTC_85545.dir/build.make CMakeFiles/cmTC_85545.dir/build
54
gmake[1]: Entering directory `/home/u0017592/projects/gromacs/build/CMakeFiles/CMakeTmp'
55
Building CXX object CMakeFiles/cmTC_85545.dir/CheckSymbolExists.cxx.o
56
/usr/bin/xlC  -+   -qthreaded -qhalt=e -std=c++11  -qarch=auto -qtune=auto     -o CMakeFiles/cmTC_85545.dir/CheckSymbolExists.cxx.o -c /home/u0017592/projects/gromacs/build/CMakeFiles/CMakeTmp/CheckSymbolExists.cxx
57
warning: 1540-5203 Unrecognized value "e" specified with option "halt".
58
/home/u0017592/projects/gromacs/build/CMakeFiles/CMakeTmp/CheckSymbolExists.cxx:8:19: error: use of undeclared identifier '_fileno'; did you mean 'fileno'?
59
  return ((int*)(&_fileno))[argc];
60
                  ^~~~~~~
61
                  fileno
62
/usr/include/stdio.h:858:12: note: 'fileno' declared here
63
extern int fileno (FILE *__stream) __THROW __wur;
64
           ^
65
1 warning and 1 error generated.
66
Error while processing /home/u0017592/projects/gromacs/build/CMakeFiles/CMakeTmp/CheckSymbolExists.cxx.
67
gmake[1]: *** [CMakeFiles/cmTC_85545.dir/CheckSymbolExists.cxx.o] Error 1
68
gmake[1]: Leaving directory `/home/u0017592/projects/gromacs/build/CMakeFiles/CMakeTmp'
69
gmake: *** [cmTC_85545/fast] Error 2
70

    
71
File /home/u0017592/projects/gromacs/build/CMakeFiles/CMakeTmp/CheckSymbolExists.cxx:
72
/* */
73
#include <stdio.h>
74

    
75
int main(int argc, char** argv)
76
{
77
  (void)argv;
78
#ifndef _fileno
79
  return ((int*)(&_fileno))[argc];
80
#else
81
  (void)argc;
82
  return 0;
83
#endif
84
}
85

    
86
Determining if the _commit exist failed with the following output:
87
Change Dir: /home/u0017592/projects/gromacs/build/CMakeFiles/CMakeTmp
88

    
89
Run Build Command:"/usr/bin/gmake" "cmTC_669b0/fast"
90
/usr/bin/gmake -f CMakeFiles/cmTC_669b0.dir/build.make CMakeFiles/cmTC_669b0.dir/build
91
gmake[1]: Entering directory `/home/u0017592/projects/gromacs/build/CMakeFiles/CMakeTmp'
92
Building CXX object CMakeFiles/cmTC_669b0.dir/CheckSymbolExists.cxx.o
93
/usr/bin/xlC  -+   -qthreaded -qhalt=e -std=c++11  -qarch=auto -qtune=auto     -o CMakeFiles/cmTC_669b0.dir/CheckSymbolExists.cxx.o -c /home/u0017592/projects/gromacs/build/CMakeFiles/CMakeTmp/CheckSymbolExists.cxx
94
warning: 1540-5203 Unrecognized value "e" specified with option "halt".
95
/home/u0017592/projects/gromacs/build/CMakeFiles/CMakeTmp/CheckSymbolExists.cxx:2:10: fatal error: 'io.h' file not found
96
#include <io.h>
97
         ^
98
1 warning and 1 error generated.
99
Error while processing /home/u0017592/projects/gromacs/build/CMakeFiles/CMakeTmp/CheckSymbolExists.cxx.
100
gmake[1]: *** [CMakeFiles/cmTC_669b0.dir/CheckSymbolExists.cxx.o] Error 1
101
gmake[1]: Leaving directory `/home/u0017592/projects/gromacs/build/CMakeFiles/CMakeTmp'
102
gmake: *** [cmTC_669b0/fast] Error 2
103

    
104
File /home/u0017592/projects/gromacs/build/CMakeFiles/CMakeTmp/CheckSymbolExists.cxx:
105
/* */
106
#include <io.h>
107

    
108
int main(int argc, char** argv)
109
{
110
  (void)argv;
111
#ifndef _commit
112
  return ((int*)(&_commit))[argc];
113
#else
114
  (void)argc;
115
  return 0;
116
#endif
117
}
118

    
119
Determining if files mm_malloc.h exist failed with the following output:
120
Change Dir: /home/u0017592/projects/gromacs/build/CMakeFiles/CMakeTmp
121

    
122
Run Build Command:"/usr/bin/gmake" "cmTC_3ac9d/fast"
123
/usr/bin/gmake -f CMakeFiles/cmTC_3ac9d.dir/build.make CMakeFiles/cmTC_3ac9d.dir/build
124
gmake[1]: Entering directory `/home/u0017592/projects/gromacs/build/CMakeFiles/CMakeTmp'
125
Building C object CMakeFiles/cmTC_3ac9d.dir/CheckIncludeFiles.c.o
126
/usr/bin/xlc    -qthreaded -qhalt=e -qsuppress=1500-036 -qsuppress=1500-010 -qsuppress=1500-030 -qlanglvl=extc99 -qarch=auto -qtune=auto     -o CMakeFiles/cmTC_3ac9d.dir/CheckIncludeFiles.c.o   -c /home/u0017592/projects/gromacs/build/CMakeFiles/CMakeTmp/CheckIncludeFiles.c
127
warning: 1540-5203 Unrecognized value "e" specified with option "halt".
128
warning: 1540-5200 The option "-qsuppress=1500-036" is not supported.
129
warning: 1540-5200 The option "-qsuppress=1500-010" is not supported.
130
warning: 1540-5200 The option "-qsuppress=1500-030" is not supported.
131
/home/u0017592/projects/gromacs/build/CMakeFiles/CMakeTmp/CheckIncludeFiles.c:2:10: fatal error: 'mm_malloc.h' file not found
132
#include <mm_malloc.h>
133
         ^
134
4 warnings and 1 error generated.
135
Error while processing /home/u0017592/projects/gromacs/build/CMakeFiles/CMakeTmp/CheckIncludeFiles.c.
136
gmake[1]: *** [CMakeFiles/cmTC_3ac9d.dir/CheckIncludeFiles.c.o] Error 1
137
gmake[1]: Leaving directory `/home/u0017592/projects/gromacs/build/CMakeFiles/CMakeTmp'
138
gmake: *** [cmTC_3ac9d/fast] Error 2
139

    
140
Source:
141
/* */
142
#include <mm_malloc.h>
143

    
144

    
145
int main(void){return 0;}
146

    
147
Determining if files xmmintrin.h exist failed with the following output:
148
Change Dir: /home/u0017592/projects/gromacs/build/CMakeFiles/CMakeTmp
149

    
150
Run Build Command:"/usr/bin/gmake" "cmTC_2f85e/fast"
151
/usr/bin/gmake -f CMakeFiles/cmTC_2f85e.dir/build.make CMakeFiles/cmTC_2f85e.dir/build
152
gmake[1]: Entering directory `/home/u0017592/projects/gromacs/build/CMakeFiles/CMakeTmp'
153
Building C object CMakeFiles/cmTC_2f85e.dir/CheckIncludeFiles.c.o
154
/usr/bin/xlc    -qthreaded -qhalt=e -qsuppress=1500-036 -qsuppress=1500-010 -qsuppress=1500-030 -qlanglvl=extc99 -qarch=auto -qtune=auto     -o CMakeFiles/cmTC_2f85e.dir/CheckIncludeFiles.c.o   -c /home/u0017592/projects/gromacs/build/CMakeFiles/CMakeTmp/CheckIncludeFiles.c
155
warning: 1540-5203 Unrecognized value "e" specified with option "halt".
156
warning: 1540-5200 The option "-qsuppress=1500-036" is not supported.
157
warning: 1540-5200 The option "-qsuppress=1500-010" is not supported.
158
warning: 1540-5200 The option "-qsuppress=1500-030" is not supported.
159
/home/u0017592/projects/gromacs/build/CMakeFiles/CMakeTmp/CheckIncludeFiles.c:2:10: fatal error: 'xmmintrin.h' file not found
160
#include <xmmintrin.h>
161
         ^
162
4 warnings and 1 error generated.
163
Error while processing /home/u0017592/projects/gromacs/build/CMakeFiles/CMakeTmp/CheckIncludeFiles.c.
164
gmake[1]: *** [CMakeFiles/cmTC_2f85e.dir/CheckIncludeFiles.c.o] Error 1
165
gmake[1]: Leaving directory `/home/u0017592/projects/gromacs/build/CMakeFiles/CMakeTmp'
166
gmake: *** [cmTC_2f85e/fast] Error 2
167

    
168
Source:
169
/* */
170
#include <xmmintrin.h>
171

    
172

    
173
int main(void){return 0;}
174

    
175
Determining if the memalign exist failed with the following output:
176
Change Dir: /home/u0017592/projects/gromacs/build/CMakeFiles/CMakeTmp
177

    
178
Run Build Command:"/usr/bin/gmake" "cmTC_7ea19/fast"
179
/usr/bin/gmake -f CMakeFiles/cmTC_7ea19.dir/build.make CMakeFiles/cmTC_7ea19.dir/build
180
gmake[1]: Entering directory `/home/u0017592/projects/gromacs/build/CMakeFiles/CMakeTmp'
181
Building CXX object CMakeFiles/cmTC_7ea19.dir/CheckSymbolExists.cxx.o
182
/usr/bin/xlC  -+   -qthreaded -qhalt=e -std=c++11  -qarch=auto -qtune=auto     -o CMakeFiles/cmTC_7ea19.dir/CheckSymbolExists.cxx.o -c /home/u0017592/projects/gromacs/build/CMakeFiles/CMakeTmp/CheckSymbolExists.cxx
183
warning: 1540-5203 Unrecognized value "e" specified with option "halt".
184
/home/u0017592/projects/gromacs/build/CMakeFiles/CMakeTmp/CheckSymbolExists.cxx:8:19: error: use of undeclared identifier 'memalign'
185
  return ((int*)(&memalign))[argc];
186
                  ^
187
1 warning and 1 error generated.
188
Error while processing /home/u0017592/projects/gromacs/build/CMakeFiles/CMakeTmp/CheckSymbolExists.cxx.
189
gmake[1]: *** [CMakeFiles/cmTC_7ea19.dir/CheckSymbolExists.cxx.o] Error 1
190
gmake[1]: Leaving directory `/home/u0017592/projects/gromacs/build/CMakeFiles/CMakeTmp'
191
gmake: *** [cmTC_7ea19/fast] Error 2
192

    
193
File /home/u0017592/projects/gromacs/build/CMakeFiles/CMakeTmp/CheckSymbolExists.cxx:
194
/* */
195
#include <stdlib.h>
196

    
197
int main(int argc, char** argv)
198
{
199
  (void)argv;
200
#ifndef memalign
201
  return ((int*)(&memalign))[argc];
202
#else
203
  (void)argc;
204
  return 0;
205
#endif
206
}
207

    
208
Performing C SOURCE FILE Test C_mvsx_FLAG_WORKS failed with the following output:
209
Change Dir: /home/u0017592/projects/gromacs/build/CMakeFiles/CMakeTmp
210

    
211
Run Build Command:"/usr/bin/gmake" "cmTC_2a5ac/fast"
212
/usr/bin/gmake -f CMakeFiles/cmTC_2a5ac.dir/build.make CMakeFiles/cmTC_2a5ac.dir/build
213
gmake[1]: Entering directory `/home/u0017592/projects/gromacs/build/CMakeFiles/CMakeTmp'
214
Building C object CMakeFiles/cmTC_2a5ac.dir/src.c.o
215
/usr/bin/xlc    -qthreaded -qhalt=e -qsuppress=1500-036 -qsuppress=1500-010 -qsuppress=1500-030 -qlanglvl=extc99 -qarch=auto -qtune=auto  -DC_mvsx_FLAG_WORKS  -mvsx   -o CMakeFiles/cmTC_2a5ac.dir/src.c.o   -c /home/u0017592/projects/gromacs/build/CMakeFiles/CMakeTmp/src.c
216
warning: 1540-5203 Unrecognized value "e" specified with option "halt".
217
warning: 1540-5200 The option "-qsuppress=1500-036" is not supported.
218
warning: 1540-5200 The option "-qsuppress=1500-010" is not supported.
219
warning: 1540-5200 The option "-qsuppress=1500-030" is not supported.
220
warning: 1540-5200 The option "-mvsx" is not supported.
221
5 warnings generated.
222
Linking C executable cmTC_2a5ac
223
/usr/bin/cmake3 -E cmake_link_script CMakeFiles/cmTC_2a5ac.dir/link.txt --verbose=1
224
/usr/bin/xlc   -qthreaded -qhalt=e -qsuppress=1500-036 -qsuppress=1500-010 -qsuppress=1500-030 -qlanglvl=extc99 -qarch=auto -qtune=auto  -DC_mvsx_FLAG_WORKS  -mvsx    CMakeFiles/cmTC_2a5ac.dir/src.c.o  -o cmTC_2a5ac 
225
gmake[1]: Leaving directory `/home/u0017592/projects/gromacs/build/CMakeFiles/CMakeTmp'
226

    
227
Source file was:
228
int main(void) { return 0; }
229
Performing C SOURCE FILE Test C_maltivec_mabi_altivec_FLAG_WORKS failed with the following output:
230
Change Dir: /home/u0017592/projects/gromacs/build/CMakeFiles/CMakeTmp
231

    
232
Run Build Command:"/usr/bin/gmake" "cmTC_4be0c/fast"
233
/usr/bin/gmake -f CMakeFiles/cmTC_4be0c.dir/build.make CMakeFiles/cmTC_4be0c.dir/build
234
gmake[1]: Entering directory `/home/u0017592/projects/gromacs/build/CMakeFiles/CMakeTmp'
235
Building C object CMakeFiles/cmTC_4be0c.dir/src.c.o
236
/usr/bin/xlc    -qthreaded -qhalt=e -qsuppress=1500-036 -qsuppress=1500-010 -qsuppress=1500-030 -qlanglvl=extc99 -qarch=auto -qtune=auto  -DC_maltivec_mabi_altivec_FLAG_WORKS  -maltivec -mabi=altivec   -o CMakeFiles/cmTC_4be0c.dir/src.c.o   -c /home/u0017592/projects/gromacs/build/CMakeFiles/CMakeTmp/src.c
237
warning: 1540-5203 Unrecognized value "e" specified with option "halt".
238
warning: 1540-5200 The option "-qsuppress=1500-036" is not supported.
239
warning: 1540-5200 The option "-qsuppress=1500-010" is not supported.
240
warning: 1540-5200 The option "-qsuppress=1500-030" is not supported.
241
warning: 1540-5200 The option "-mabi=altivec" is not supported.
242
5 warnings generated.
243
Linking C executable cmTC_4be0c
244
/usr/bin/cmake3 -E cmake_link_script CMakeFiles/cmTC_4be0c.dir/link.txt --verbose=1
245
/usr/bin/xlc   -qthreaded -qhalt=e -qsuppress=1500-036 -qsuppress=1500-010 -qsuppress=1500-030 -qlanglvl=extc99 -qarch=auto -qtune=auto  -DC_maltivec_mabi_altivec_FLAG_WORKS  -maltivec -mabi=altivec    CMakeFiles/cmTC_4be0c.dir/src.c.o  -o cmTC_4be0c 
246
gmake[1]: Leaving directory `/home/u0017592/projects/gromacs/build/CMakeFiles/CMakeTmp'
247

    
248
Source file was:
249
int main(void) { return 0; }
250
Performing C SOURCE FILE Test C_qarch_auto_qaltivec_FLAG_WORKS failed with the following output:
251
Change Dir: /home/u0017592/projects/gromacs/build/CMakeFiles/CMakeTmp
252

    
253
Run Build Command:"/usr/bin/gmake" "cmTC_2f6d8/fast"
254
/usr/bin/gmake -f CMakeFiles/cmTC_2f6d8.dir/build.make CMakeFiles/cmTC_2f6d8.dir/build
255
gmake[1]: Entering directory `/home/u0017592/projects/gromacs/build/CMakeFiles/CMakeTmp'
256
Building C object CMakeFiles/cmTC_2f6d8.dir/src.c.o
257
/usr/bin/xlc    -qthreaded -qhalt=e -qsuppress=1500-036 -qsuppress=1500-010 -qsuppress=1500-030 -qlanglvl=extc99 -qarch=auto -qtune=auto  -DC_qarch_auto_qaltivec_FLAG_WORKS  -qarch=auto -qaltivec   -o CMakeFiles/cmTC_2f6d8.dir/src.c.o   -c /home/u0017592/projects/gromacs/build/CMakeFiles/CMakeTmp/src.c
258
warning: 1540-5203 Unrecognized value "e" specified with option "halt".
259
warning: 1540-5200 The option "-qsuppress=1500-036" is not supported.
260
warning: 1540-5200 The option "-qsuppress=1500-010" is not supported.
261
warning: 1540-5200 The option "-qsuppress=1500-030" is not supported.
262
4 warnings generated.
263
Linking C executable cmTC_2f6d8
264
/usr/bin/cmake3 -E cmake_link_script CMakeFiles/cmTC_2f6d8.dir/link.txt --verbose=1
265
/usr/bin/xlc   -qthreaded -qhalt=e -qsuppress=1500-036 -qsuppress=1500-010 -qsuppress=1500-030 -qlanglvl=extc99 -qarch=auto -qtune=auto  -DC_qarch_auto_qaltivec_FLAG_WORKS  -qarch=auto -qaltivec    CMakeFiles/cmTC_2f6d8.dir/src.c.o  -o cmTC_2f6d8 
266
gmake[1]: Leaving directory `/home/u0017592/projects/gromacs/build/CMakeFiles/CMakeTmp'
267

    
268
Source file was:
269
int main(void) { return 0; }
270
Performing C SOURCE FILE Test C_FLAG_WORKS failed with the following output:
271
Change Dir: /home/u0017592/projects/gromacs/build/CMakeFiles/CMakeTmp
272

    
273
Run Build Command:"/usr/bin/gmake" "cmTC_86575/fast"
274
/usr/bin/gmake -f CMakeFiles/cmTC_86575.dir/build.make CMakeFiles/cmTC_86575.dir/build
275
gmake[1]: Entering directory `/home/u0017592/projects/gromacs/build/CMakeFiles/CMakeTmp'
276
Building C object CMakeFiles/cmTC_86575.dir/src.c.o
277
/usr/bin/xlc    -qthreaded -qhalt=e -qsuppress=1500-036 -qsuppress=1500-010 -qsuppress=1500-030 -qlanglvl=extc99 -qarch=auto -qtune=auto  -DC_FLAG_WORKS   -o CMakeFiles/cmTC_86575.dir/src.c.o   -c /home/u0017592/projects/gromacs/build/CMakeFiles/CMakeTmp/src.c
278
warning: 1540-5203 Unrecognized value "e" specified with option "halt".
279
warning: 1540-5200 The option "-qsuppress=1500-036" is not supported.
280
warning: 1540-5200 The option "-qsuppress=1500-010" is not supported.
281
warning: 1540-5200 The option "-qsuppress=1500-030" is not supported.
282
4 warnings generated.
283
Linking C executable cmTC_86575
284
/usr/bin/cmake3 -E cmake_link_script CMakeFiles/cmTC_86575.dir/link.txt --verbose=1
285
/usr/bin/xlc   -qthreaded -qhalt=e -qsuppress=1500-036 -qsuppress=1500-010 -qsuppress=1500-030 -qlanglvl=extc99 -qarch=auto -qtune=auto  -DC_FLAG_WORKS    CMakeFiles/cmTC_86575.dir/src.c.o  -o cmTC_86575 
286
gmake[1]: Leaving directory `/home/u0017592/projects/gromacs/build/CMakeFiles/CMakeTmp'
287

    
288
Source file was:
289
int main(void) { return 0; }
290
Performing C++ SOURCE FILE Test CXX_mvsx_FLAG_WORKS failed with the following output:
291
Change Dir: /home/u0017592/projects/gromacs/build/CMakeFiles/CMakeTmp
292

    
293
Run Build Command:"/usr/bin/gmake" "cmTC_e46de/fast"
294
/usr/bin/gmake -f CMakeFiles/cmTC_e46de.dir/build.make CMakeFiles/cmTC_e46de.dir/build
295
gmake[1]: Entering directory `/home/u0017592/projects/gromacs/build/CMakeFiles/CMakeTmp'
296
Building CXX object CMakeFiles/cmTC_e46de.dir/src.cxx.o
297
/usr/bin/xlC  -+   -qthreaded -qhalt=e -std=c++11  -qarch=auto -qtune=auto  -DCXX_mvsx_FLAG_WORKS  -mvsx   -o CMakeFiles/cmTC_e46de.dir/src.cxx.o -c /home/u0017592/projects/gromacs/build/CMakeFiles/CMakeTmp/src.cxx
298
warning: 1540-5203 Unrecognized value "e" specified with option "halt".
299
warning: 1540-5200 The option "-mvsx" is not supported.
300
2 warnings generated.
301
Linking CXX executable cmTC_e46de
302
/usr/bin/cmake3 -E cmake_link_script CMakeFiles/cmTC_e46de.dir/link.txt --verbose=1
303
/usr/bin/xlC    -qthreaded -qhalt=e -std=c++11  -qarch=auto -qtune=auto  -DCXX_mvsx_FLAG_WORKS  -mvsx    CMakeFiles/cmTC_e46de.dir/src.cxx.o  -o cmTC_e46de 
304
gmake[1]: Leaving directory `/home/u0017592/projects/gromacs/build/CMakeFiles/CMakeTmp'
305

    
306
Source file was:
307
int main() { return 0;}
308
Performing C++ SOURCE FILE Test CXX_maltivec_mabi_altivec_FLAG_WORKS failed with the following output:
309
Change Dir: /home/u0017592/projects/gromacs/build/CMakeFiles/CMakeTmp
310

    
311
Run Build Command:"/usr/bin/gmake" "cmTC_219ee/fast"
312
/usr/bin/gmake -f CMakeFiles/cmTC_219ee.dir/build.make CMakeFiles/cmTC_219ee.dir/build
313
gmake[1]: Entering directory `/home/u0017592/projects/gromacs/build/CMakeFiles/CMakeTmp'
314
Building CXX object CMakeFiles/cmTC_219ee.dir/src.cxx.o
315
/usr/bin/xlC  -+   -qthreaded -qhalt=e -std=c++11  -qarch=auto -qtune=auto  -DCXX_maltivec_mabi_altivec_FLAG_WORKS  -maltivec -mabi=altivec   -o CMakeFiles/cmTC_219ee.dir/src.cxx.o -c /home/u0017592/projects/gromacs/build/CMakeFiles/CMakeTmp/src.cxx
316
warning: 1540-5203 Unrecognized value "e" specified with option "halt".
317
warning: 1540-5200 The option "-mabi=altivec" is not supported.
318
2 warnings generated.
319
Linking CXX executable cmTC_219ee
320
/usr/bin/cmake3 -E cmake_link_script CMakeFiles/cmTC_219ee.dir/link.txt --verbose=1
321
/usr/bin/xlC    -qthreaded -qhalt=e -std=c++11  -qarch=auto -qtune=auto  -DCXX_maltivec_mabi_altivec_FLAG_WORKS  -maltivec -mabi=altivec    CMakeFiles/cmTC_219ee.dir/src.cxx.o  -o cmTC_219ee 
322
gmake[1]: Leaving directory `/home/u0017592/projects/gromacs/build/CMakeFiles/CMakeTmp'
323

    
324
Source file was:
325
int main() { return 0;}